{"text_format":"1","workbook":"xlsx","n_sheets":4,"sheets":["Konfiguration","Technische Daten","Texte","physikalischer Aufbau"],"not_rendered":{"charts":0,"images":4,"macros":1,"external_links":0,"defined_names":34,"comments":3,"pivot_tables":0},"unopened":[],"bounds":{"document_bytes":16777216,"sheet_cells":100000,"rows_first":2000,"rows_last":500,"rows_between":2000,"halvings":0,"cell_chars":16384,"cell_head_chars":4096},"cells_cut":0,"cells_raw":0,"read":"whole","date_system":"1900"}

{"sheet":"Konfiguration","index":0,"n_rows":104,"n_cols":50,"rows_kept":104,"cut":false,"hidden":false,"merged":[[0,1,1,1]]}
["V1.13",{"$f":"Texte!B44","v":"durchschnittliche Ausgangsbelastung(%)"},{"$f":"Texte!B45","v":"CANopen"},{"$f":"Texte!$B46","v":"PROFIBUS"},{"$f":"Texte!$B47","v":"EtherCAT"},{"$f":"Texte!$B48","v":"PROFINET"},{"$f":"Texte!$B49","v":"DeviceNet"},{"$f":"Texte!$B50","v":"Modbus TCP"},{"$f":"Texte!$B51","v":"L-force Controller"},{"$f":"Texte!$B52","v":"2 DI"},{"$f":"Texte!$B53","v":"4 DI"},{"$f":"Texte!$B54","v":"8 DI"},{"$f":"Texte!$B55","v":"4 DI 3-Leiter"},{"$f":"Texte!$B56","v":"2 DI NPN"},{"$f":"Texte!$B57","v":"4 DI NPN"},{"$f":"Texte!$B58","v":"8 DI NPN"},{"$f":"Texte!$B59","v":"2 DI 2µs"},{"$f":"Texte!$B60","v":"2 DO"},{"$f":"Texte!$B61","v":"4 DO"},{"$f":"Texte!$B62","v":"8 DO"},{"$f":"Texte!$B63","v":"2 DO NPN"},{"$f":"Texte!$B64","v":"4 DO NPN"},{"$f":"Texte!$B65","v":"8 DO NPN"},{"$f":"Texte!$B66","v":"2 DO 2A"},{"$f":"Texte!B67","v":"2 DO Relais"},{"$f":"Texte!$B68","v":"4 DO 2A"},{"$f":"Texte!$B69","v":"2 DO 1µs"},{"$f":"Texte!$B70","v":"2 AI 0..10V"},{"$f":"Texte!$B71","v":"4 AI 0..10V"},{"$f":"Texte!$B72","v":"2 AI 0(4)-20mA"},{"$f":"Texte!$B73","v":"4 AI 0(4)-20mA"},{"$f":"Texte!$B74","v":"4 AI Resistor"},{"$f":"Texte!$B75","v":"2 AI Thermo"},{"$f":"Texte!$B76","v":"2 AI -10..10 V 16 Bit"},{"$f":"Texte!$B77","v":"2 AI 0(4)..20 mA 16 Bit"},{"$f":"Texte!$B78","v":"2 AO 0..10V"},{"$f":"Texte!$B79","v":"4 AO 0..10V"},{"$f":"Texte!$B80","v":"2 AO 4..20mA"},{"$f":"Texte!$B81","v":"4 AO 4..20mA"},{"$f":"Texte!$B82","v":"1-fach Zähler 24 V / 1 DO"},{"$f":"Texte!$B83","v":"2-fach Zähler 24 V"},{"$f":"Texte!$B84","v":"1-fach Zähler 5 V"},{"$f":"Texte!$B83","v":"2-fach Zähler 24 V"},{"$f":"Texte!$B86","v":"SSI"},{"$f":"Texte!$B87","v":"PWM"},{"$f":"Texte!$B88","v":"RS 232"},{"$f":"Texte!$B89","v":"RS 422/485"},{"$f":"Texte!$B91","v":"I/O-Versorgung (Sicherung)"},{"$f":"Texte!$B92","v":"I/O / Elektronik"},{"$f":"Texte!$B92","v":"I/O / Elektronik"}]
["DE",null,"EPM-S110","EPM-S120","EPM-S130","EPM-S140","EPM-S150","EPM-S160","3200 C","EPM-S200","EPM-S201","EPM-S202","EPM-S203","EPM-S204","EPM-S205","EPM-S206","EPM-S207","EPM-S300","EPM-S301","EPM-S302","EPM-S303","EPM-S304","EPM-S305","EPM-S306","EPM-S308","EPM-S309","EPM-S310","EPM-S400","EPM-S401","EPM-S402","EPM-S403","EPM-S404","EPM-S405","EPM-S406","EPM-S408","EPM-S500","EPM-S501","EPM-S502","EPM-S503","EPM-S600","EPM-S601","EPM-S602","EPM-S603","EPM-S604","EPM-S620","EPM-S640","EPM-S650","EPM-S701","EPM-S702","EPM-S703"]
[{"$f":"Texte!B116","v":"Eingabe Bedarf"},0.625]
[{"$f":"Texte!B104","v":"Summe physikalischer Aufbau"},null,{"$f":"SUMIF('physikalischer Aufbau'!$D$4:$D$132,Konfiguration!C2,'physikalischer Aufbau'!$O$4:$O$132)","v":0},{"$f":"SUMIF('physikalischer Aufbau'!$D$4:$D$132,Konfiguration!D2,'physikalischer Aufbau'!$O$4:$O$132)","v":0},{"$f":"SUMIF('physikalischer Aufbau'!$D$4:$D$132,Konfiguration!E2,'physikalischer Aufbau'!$O$4:$O$132)","v":0},{"$f":"SUMIF('physikalischer Aufbau'!$D$4:$D$132,Konfiguration!F2,'physikalischer Aufbau'!$O$4:$O$132)","v":0},{"$f":"SUMIF('physikalischer Aufbau'!$D$4:$D$132,Konfiguration!G2,'physikalischer Aufbau'!$O$4:$O$132)","v":0},{"$f":"SUMIF('physikalischer Aufbau'!$D$4:$D$132,Konfiguration!H2,'physikalischer Aufbau'!$O$4:$O$132)","v":0},{"$f":"SUMIF('physikalischer Aufbau'!$D$4:$D$132,Konfiguration!I2,'physikalischer Aufbau'!$O$4:$O$132)","v":0},{"$f":"SUMIF('physikalischer Aufbau'!$D$4:$D$132,Konfiguration!J2,'physikalischer Aufbau'!$O$4:$O$132)","v":0},{"$f":"SUMIF('physikalischer Aufbau'!$D$4:$D$132,Konfiguration!K2,'physikalischer Aufbau'!$O$4:$O$132)","v":0},{"$f":"SUMIF('physikalischer Aufbau'!$D$4:$D$132,Konfiguration!L2,'physikalischer Aufbau'!$O$4:$O$132)","v":0},{"$f":"SUMIF('physikalischer Aufbau'!$D$4:$D$132,Konfiguration!M2,'physikalischer Aufbau'!$O$4:$O$132)","v":0},{"$f":"SUMIF('physikalischer Aufbau'!$D$4:$D$132,Konfiguration!N2,'physikalischer Aufbau'!$O$4:$O$132)","v":0},{"$f":"SUMIF('physikalischer Aufbau'!$D$4:$D$132,Konfiguration!O2,'physikalischer Aufbau'!$O$4:$O$132)","v":0},{"$f":"SUMIF('physikalischer Aufbau'!$D$4:$D$132,Konfiguration!P2,'physikalischer Aufbau'!$O$4:$O$132)","v":0},{"$f":"SUMIF('physikalischer Aufbau'!$D$4:$D$132,Konfiguration!Q2,'physikalischer Aufbau'!$O$4:$O$132)","v":0},{"$f":"SUMIF('physikalischer Aufbau'!$D$4:$D$132,Konfiguration!R2,'physikalischer Aufbau'!$O$4:$O$132)","v":0},{"$f":"SUMIF('physikalischer Aufbau'!$D$4:$D$132,Konfiguration!S2,'physikalischer Aufbau'!$O$4:$O$132)","v":0},{"$f":"SUMIF('physikalischer Aufbau'!$D$4:$D$132,Konfiguration!T2,'physikalischer Aufbau'!$O$4:$O$132)","v":0},{"$f":"SUMIF('physikalischer Aufbau'!$D$4:$D$132,Konfiguration!U2,'physikalischer Aufbau'!$O$4:$O$132)","v":0},{"$f":"SUMIF('physikalischer Aufbau'!$D$4:$D$132,Konfiguration!V2,'physikalischer Aufbau'!$O$4:$O$132)","v":0},{"$f":"SUMIF('physikalischer Aufbau'!$D$4:$D$132,Konfiguration!W2,'physikalischer Aufbau'!$O$4:$O$132)","v":0},{"$f":"SUMIF('physikalischer Aufbau'!$D$4:$D$132,Konfiguration!X2,'physikalischer Aufbau'!$O$4:$O$132)","v":0},{"$f":"SUMIF('physikalischer Aufbau'!$D$4:$D$132,Konfiguration!Y2,'physikalischer Aufbau'!$O$4:$O$132)","v":0},{"$f":"SUMIF('physikalischer Aufbau'!$D$4:$D$132,Konfiguration!Z2,'physikalischer Aufbau'!$O$4:$O$132)","v":0},{"$f":"SUMIF('physikalischer Aufbau'!$D$4:$D$132,Konfiguration!AA2,'physikalischer Aufbau'!$O$4:$O$132)","v":0},{"$f":"SUMIF('physikalischer Aufbau'!$D$4:$D$132,Konfiguration!AB2,'physikalischer Aufbau'!$O$4:$O$132)","v":0},{"$f":"SUMIF('physikalischer Aufbau'!$D$4:$D$132,Konfiguration!AC2,'physikalischer Aufbau'!$O$4:$O$132)","v":0},{"$f":"SUMIF('physikalischer Aufbau'!$D$4:$D$132,Konfiguration!AD2,'physikalischer Aufbau'!$O$4:$O$132)","v":0},{"$f":"SUMIF('physikalischer Aufbau'!$D$4:$D$132,Konfiguration!AE2,'physikalischer Aufbau'!$O$4:$O$132)","v":0},{"$f":"SUMIF('physikalischer Aufbau'!$D$4:$D$132,Konfiguration!AF2,'physikalischer Aufbau'!$O$4:$O$132)","v":0},{"$f":"SUMIF('physikalischer Aufbau'!$D$4:$D$132,Konfiguration!AG2,'physikalischer Aufbau'!$O$4:$O$132)","v":0},null,null,{"$f":"SUMIF('physikalischer Aufbau'!$D$4:$D$132,Konfiguration!AJ2,'physikalischer Aufbau'!$O$4:$O$132)","v":0},{"$f":"SUMIF('physikalischer Aufbau'!$D$4:$D$132,Konfiguration!AK2,'physikalischer Aufbau'!$O$4:$O$132)","v":0},{"$f":"SUMIF('physikalischer Aufbau'!$D$4:$D$132,Konfiguration!AL2,'physikalischer Aufbau'!$O$4:$O$132)","v":0},{"$f":"SUMIF('physikalischer Aufbau'!$D$4:$D$132,Konfiguration!AM2,'physikalischer Aufbau'!$O$4:$O$132)","v":0},{"$f":"SUMIF('physikalischer Aufbau'!$D$4:$D$132,Konfiguration!AN2,'physikalischer Aufbau'!$O$4:$O$132)","v":0},{"$f":"SUMIF('physikalischer Aufbau'!$D$4:$D$132,Konfiguration!AO2,'physikalischer Aufbau'!$O$4:$O$132)","v":0},{"$f":"SUMIF('physikalischer Aufbau'!$D$4:$D$132,Konfiguration!AP2,'physikalischer Aufbau'!$O$4:$O$132)","v":0},{"$f":"SUMIF('physikalischer Aufbau'!$D$4:$D$132,Konfiguration!AQ2,'physikalischer Aufbau'!$O$4:$O$132)","v":0},{"$f":"SUMIF('physikalischer Aufbau'!$D$4:$D$132,Konfiguration!AR2,'physikalischer Aufbau'!$O$4:$O$132)","v":0},{"$f":"SUMIF('physikalischer Aufbau'!$D$4:$D$132,Konfiguration!AS2,'physikalischer Aufbau'!$O$4:$O$132)","v":0},{"$f":"SUMIF('physikalischer Aufbau'!$D$4:$D$132,Konfiguration!AT2,'physikalischer Aufbau'!$O$4:$O$132)","v":0},{"$f":"SUMIF('physikalischer Aufbau'!$D$4:$D$132,Konfiguration!AU2,'physikalischer Aufbau'!$O$4:$O$132)","v":0},{"$f":"SUMIF('physikalischer Aufbau'!$D$4:$D$132,Konfiguration!AV2,'physikalischer Aufbau'!$O$4:$O$132)","v":0},null,{"$f":"SUMIF('physikalischer Aufbau'!$D$4:$D$132,Konfiguration!AX2,'physikalischer Aufbau'!$O$4:$O$132)","v":0}]
[{"$f":"Texte!$B$106","v":"Stromschienenbelastung (UL)"},"10A",{"$f":"IF(EPM_S110 + EPM_S120 + EPM_S130 + EPM_S140 + EPM_S150 + EPM_S160 + _3200_C< 2,1,0)","v":1},0,null,null,null,null,null,{"$f":"IF(B61<=64,1,\"\")","v":1}]
[]
[{"$f":"Texte!B2","v":"Elektronikversorgung"}]
[{"$f":"Texte!B3","v":"Gesamtstrombelastung Elektronik (A)"},{"$f":"SUM(J8:AT8) / 1000 * (-1)","v":0},{"$f":"IF(C$3<>\"\",C$3*VLOOKUP(C$2,'Technische Daten'!$A:$G,2,0),0)","v":0},{"$f":"IF(D$3<>\"\",D$3*VLOOKUP(D$2,'Technische Daten'!$A:$G,2,0),0)","v":0},{"$f":"IF(E$3<>\"\",E$3*VLOOKUP(E$2,'Technische Daten'!$A:$G,2,0),0)","v":0},{"$f":"IF(F$3<>\"\",F$3*VLOOKUP(F$2,'Technische Daten'!$A:$G,2,0),0)","v":0},{"$f":"IF(G$3<>\"\",G$3*VLOOKUP(G$2,'Technische Daten'!$A:$G,2,0),0)","v":0},{"$f":"IF(H$3<>\"\",H$3*VLOOKUP(H$2,'Technische Daten'!$A:$G,2,0),0)","v":0},{"$f":"IF(I$3<>\"\",I$3*VLOOKUP(I$2,'Technische Daten'!$A:$G,2,0),0)","v":0},{"$f":"IF(J$3<>\"\",J$3*VLOOKUP(J$2,'Technische Daten'!$A:$G,2,0),0)","v":0},{"$f":"IF(K$3<>\"\",K$3*VLOOKUP(K$2,'Technische Daten'!$A:$G,2,0),0)","v":0},{"$f":"IF(L$3<>\"\",L$3*VLOOKUP(L$2,'Technische Daten'!$A:$G,2,0),0)","v":0},{"$f":"IF(M$3<>\"\",M$3*VLOOKUP(M$2,'Technische Daten'!$A:$G,2,0),0)","v":0},{"$f":"IF(N$3<>\"\",N$3*VLOOKUP(N$2,'Technische Daten'!$A:$G,2,0),0)","v":0},{"$f":"IF(O$3<>\"\",O$3*VLOOKUP(O$2,'Technische Daten'!$A:$G,2,0),0)","v":0},{"$f":"IF(P$3<>\"\",P$3*VLOOKUP(P$2,'Technische Daten'!$A:$G,2,0),0)","v":0},{"$f":"IF(Q$3<>\"\",Q$3*VLOOKUP(Q$2,'Technische Daten'!$A:$G,2,0),0)","v":0},{"$f":"IF(R$3<>\"\",R$3*VLOOKUP(R$2,'Technische Daten'!$A:$G,2,0),0)","v":0},{"$f":"IF(S$3<>\"\",S$3*VLOOKUP(S$2,'Technische Daten'!$A:$G,2,0),0)","v":0},{"$f":"IF(T$3<>\"\",T$3*VLOOKUP(T$2,'Technische Daten'!$A:$G,2,0),0)","v":0},{"$f":"IF(U$3<>\"\",U$3*VLOOKUP(U$2,'Technische Daten'!$A:$G,2,0),0)","v":0},{"$f":"IF(V$3<>\"\",V$3*VLOOKUP(V$2,'Technische Daten'!$A:$G,2,0),0)","v":0},{"$f":"IF(W$3<>\"\",W$3*VLOOKUP(W$2,'Technische Daten'!$A:$G,2,0),0)","v":0},{"$f":"IF(X$3<>\"\",X$3*VLOOKUP(X$2,'Technische Daten'!$A:$G,2,0),0)","v":0},{"$f":"IF(Y$3<>\"\",Y$3*VLOOKUP(Y$2,'Technische Daten'!$A:$G,2,0),0)","v":0},{"$f":"IF(Z$3<>\"\",Z$3*VLOOKUP(Z$2,'Technische Daten'!$A:$G,2,0),0)","v":0},{"$f":"IF(AA$3<>\"\",AA$3*VLOOKUP(AA$2,'Technische Daten'!$A:$G,2,0),0)","v":0},{"$f":"IF(AB$3<>\"\",AB$3*VLOOKUP(AB$2,'Technische Daten'!$A:$G,2,0),0)","v":0},{"$f":"IF(AC$3<>\"\",AC$3*VLOOKUP(AC$2,'Technische Daten'!$A:$G,2,0),0)","v":0},{"$f":"IF(AD$3<>\"\",AD$3*VLOOKUP(AD$2,'Technische Daten'!$A:$G,2,0),0)","v":0},{"$f":"IF(AE$3<>\"\",AE$3*VLOOKUP(AE$2,'Technische Daten'!$A:$G,2,0),0)","v":0},{"$f":"IF(AF$3<>\"\",AF$3*VLOOKUP(AF$2,'Technische Daten'!$A:$G,2,0),0)","v":0},{"$f":"IF(AG$3<>\"\",AG$3*VLOOKUP(AG$2,'Technische Daten'!$A:$G,2,0),0)","v":0},{"$f":"IF(AH$3<>\"\",AH$3*VLOOKUP(AH$2,'Technische Daten'!$A:$G,2,0),0)","v":0},{"$f":"IF(AI$3<>\"\",AI$3*VLOOKUP(AI$2,'Technische Daten'!$A:$G,2,0),0)","v":0},{"$f":"IF(AJ$3<>\"\",AJ$3*VLOOKUP(AJ$2,'Technische Daten'!$A:$G,2,0),0)","v":0},{"$f":"IF(AK$3<>\"\",AK$3*VLOOKUP(AK$2,'Technische Daten'!$A:$G,2,0),0)","v":0},{"$f":"IF(AL$3<>\"\",AL$3*VLOOKUP(AL$2,'Technische Daten'!$A:$G,2,0),0)","v":0},{"$f":"IF(AM$3<>\"\",AM$3*VLOOKUP(AM$2,'Technische Daten'!$A:$G,2,0),0)","v":0},{"$f":"IF(AN$3<>\"\",AN$3*VLOOKUP(AN$2,'Technische Daten'!$A:$G,2,0),0)","v":0},{"$f":"IF(AO$3<>\"\",AO$3*VLOOKUP(AO$2,'Technische Daten'!$A:$G,2,0),0)","v":0},{"$f":"IF(AP$3<>\"\",AP$3*VLOOKUP(AP$2,'Technische Daten'!$A:$G,2,0),0)","v":0},{"$f":"IF(AQ$3<>\"\",AQ$3*VLOOKUP(AQ$2,'Technische Daten'!$A:$G,2,0),0)","v":0},{"$f":"IF(AR$3<>\"\",AR$3*VLOOKUP(AR$2,'Technische Daten'!$A:$G,2,0),0)","v":0},{"$f":"IF(AS$3<>\"\",AS$3*VLOOKUP(AS$2,'Technische Daten'!$A:$G,2,0),0)","v":0},{"$f":"IF(AT$3<>\"\",AT$3*VLOOKUP(AT$2,'Technische Daten'!$A:$G,2,0),0)","v":0},{"$f":"IF(AU$3<>\"\",AU$3*VLOOKUP(AU$2,'Technische Daten'!$A:$G,2,0),0)","v":0},{"$f":"IF(AV$3<>\"\",AV$3*VLOOKUP(AV$2,'Technische Daten'!$A:$G,2,0),0)","v":0},{"$f":"IF(AW$3<>\"\",AW$3*VLOOKUP(AW$2,'Technische Daten'!$A:$G,2,0),0)","v":0},{"$f":"IF(AX$3<>\"\",AX$3*VLOOKUP(AX$2,'Technische Daten'!$A:$G,2,0),0)","v":0}]
[{"$f":"Texte!B4","v":"Einspeisestrom Elektronik (A)"},{"$f":"(SUM(C8:I8)+SUM(AU8:AX8))/1000","v":0}]
[{"$f":"Texte!B5","v":"benötigte Powermodule EPM-S702"},{"$f":"IF(SUM(C8:AT8)<0,ROUNDUP(SUM(C8:AT8)*(-1)/VLOOKUP($AW$2,'Technische Daten'!$A:$G,2,0),0),0)","v":0}]
[{"$f":"Texte!B6","v":"Konfigurationscheck"},{"$f":"IF((B9-B8) >= 0,\"OK\",\"NOK\")","v":"OK"}]
[]
[{"$f":"Texte!B7","v":"I/O-Versorgung"}]
[{"$f":"Texte!B8","v":"Gesamtstrom I/O (A)"},{"$f":"SUM(J14:AT14) / 1000 * (-1)","v":0},{"$f":"IF(C$3<>\"\",C$3*VLOOKUP(C$2,'Technische Daten'!$A:$G,3,0) + VLOOKUP(C$2,'Technische Daten'!$A:$G,4,0) + VLOOKUP(C$2,'Technische Daten'!$A:$G,5,0),0)","v":0},{"$f":"IF(D$3<>\"\",D$3*VLOOKUP(D$2,'Technische Daten'!$A:$G,3,0) + VLOOKUP(D$2,'Technische Daten'!$A:$G,4,0) + VLOOKUP(D$2,'Technische Daten'!$A:$G,5,0),0)","v":0},{"$f":"IF(E$3<>\"\",E$3*VLOOKUP(E$2,'Technische Daten'!$A:$G,3,0) + VLOOKUP(E$2,'Technische Daten'!$A:$G,4,0) + VLOOKUP(E$2,'Technische Daten'!$A:$G,5,0),0)","v":0},{"$f":"IF(F$3<>\"\",F$3*VLOOKUP(F$2,'Technische Daten'!$A:$G,3,0) + VLOOKUP(F$2,'Technische Daten'!$A:$G,4,0) + VLOOKUP(F$2,'Technische Daten'!$A:$G,5,0),0)","v":0},{"$f":"IF(G$3<>\"\",G$3*VLOOKUP(G$2,'Technische Daten'!$A:$G,3,0) + VLOOKUP(G$2,'Technische Daten'!$A:$G,4,0) + VLOOKUP(G$2,'Technische Daten'!$A:$G,5,0),0)","v":0},{"$f":"IF(H$3<>\"\",H$3*VLOOKUP(H$2,'Technische Daten'!$A:$G,3,0) + VLOOKUP(H$2,'Technische Daten'!$A:$G,4,0) + VLOOKUP(H$2,'Technische Daten'!$A:$G,5,0),0)","v":0},{"$f":"IF(I$3<>\"\",I$3*VLOOKUP(I$2,'Technische Daten'!$A:$G,3,0) + VLOOKUP(I$2,'Technische Daten'!$A:$G,4,0) + VLOOKUP(I$2,'Technische Daten'!$A:$G,5,0),0)","v":0},{"$f":"IF(J$3<>\"\",$B$3 * J$3*VLOOKUP(J$2,'Technische Daten'!$A:$G,3,0) + J$3*VLOOKUP(J$2,'Technische Daten'!$A:$G,4,0) + J$3*VLOOKUP(J$2,'Technische Daten'!$A:$G,5,0),0)","v":0},{"$f":"IF(K$3<>\"\",$B$3 * K$3*VLOOKUP(K$2,'Technische Daten'!$A:$G,3,0) + K$3*VLOOKUP(K$2,'Technische Daten'!$A:$G,4,0) + K$3*VLOOKUP(K$2,'Technische Daten'!$A:$G,5,0),0)","v":0},{"$f":"IF(L$3<>\"\",$B$3 * L$3*VLOOKUP(L$2,'Technische Daten'!$A:$G,3,0) + L$3*VLOOKUP(L$2,'Technische Daten'!$A:$G,4,0) + L$3*VLOOKUP(L$2,'Technische Daten'!$A:$G,5,0),0)","v":0},{"$f":"IF(M$3<>\"\",$B$3 * M$3*VLOOKUP(M$2,'Technische Daten'!$A:$G,3,0) + M$3*VLOOKUP(M$2,'Technische Daten'!$A:$G,4,0) + M$3*VLOOKUP(M$2,'Technische Daten'!$A:$G,5,0),0)","v":0},{"$f":"IF(N$3<>\"\",$B$3 * N$3*VLOOKUP(N$2,'Technische Daten'!$A:$G,3,0) + N$3*VLOOKUP(N$2,'Technische Daten'!$A:$G,4,0) + N$3*VLOOKUP(N$2,'Technische Daten'!$A:$G,5,0),0)","v":0},{"$f":"IF(O$3<>\"\",$B$3 * O$3*VLOOKUP(O$2,'Technische Daten'!$A:$G,3,0) + O$3*VLOOKUP(O$2,'Technische Daten'!$A:$G,4,0) + O$3*VLOOKUP(O$2,'Technische Daten'!$A:$G,5,0),0)","v":0},{"$f":"IF(P$3<>\"\",$B$3 * P$3*VLOOKUP(P$2,'Technische Daten'!$A:$G,3,0) + P$3*VLOOKUP(P$2,'Technische Daten'!$A:$G,4,0) + P$3*VLOOKUP(P$2,'Technische Daten'!$A:$G,5,0),0)","v":0},{"$f":"IF(Q$3<>\"\",$B$3 * Q$3*VLOOKUP(Q$2,'Technische Daten'!$A:$G,3,0) + Q$3*VLOOKUP(Q$2,'Technische Daten'!$A:$G,4,0) + Q$3*VLOOKUP(Q$2,'Technische Daten'!$A:$G,5,0),0)","v":0},{"$f":"IF(R$3<>\"\",$B$3 * R$3*VLOOKUP(R$2,'Technische Daten'!$A:$G,3,0) + R$3*VLOOKUP(R$2,'Technische Daten'!$A:$G,4,0) + R$3*VLOOKUP(R$2,'Technische Daten'!$A:$G,5,0),0)","v":0},{"$f":"IF(S$3<>\"\",$B$3 * S$3*VLOOKUP(S$2,'Technische Daten'!$A:$G,3,0) + S$3*VLOOKUP(S$2,'Technische Daten'!$A:$G,4,0) + S$3*VLOOKUP(S$2,'Technische Daten'!$A:$G,5,0),0)","v":0},{"$f":"IF(T$3<>\"\",$B$3 * T$3*VLOOKUP(T$2,'Technische Daten'!$A:$G,3,0) + T$3*VLOOKUP(T$2,'Technische Daten'!$A:$G,4,0) + T$3*VLOOKUP(T$2,'Technische Daten'!$A:$G,5,0),0)","v":0},{"$f":"IF(U$3<>\"\",$B$3 * U$3*VLOOKUP(U$2,'Technische Daten'!$A:$G,3,0) + U$3*VLOOKUP(U$2,'Technische Daten'!$A:$G,4,0) + U$3*VLOOKUP(U$2,'Technische Daten'!$A:$G,5,0),0)","v":0},{"$f":"IF(V$3<>\"\",$B$3 * V$3*VLOOKUP(V$2,'Technische Daten'!$A:$G,3,0) + V$3*VLOOKUP(V$2,'Technische Daten'!$A:$G,4,0) + V$3*VLOOKUP(V$2,'Technische Daten'!$A:$G,5,0),0)","v":0},{"$f":"IF(W$3<>\"\",$B$3 * W$3*VLOOKUP(W$2,'Technische Daten'!$A:$G,3,0) + W$3*VLOOKUP(W$2,'Technische Daten'!$A:$G,4,0) + W$3*VLOOKUP(W$2,'Technische Daten'!$A:$G,5,0),0)","v":0},{"$f":"IF(X$3<>\"\",$B$3 * X$3*VLOOKUP(X$2,'Technische Daten'!$A:$G,3,0) + X$3*VLOOKUP(X$2,'Technische Daten'!$A:$G,4,0) + X$3*VLOOKUP(X$2,'Technische Daten'!$A:$G,5,0),0)","v":0},{"$f":"IF(Y$3<>\"\",$B$3 * Y$3*VLOOKUP(Y$2,'Technische Daten'!$A:$G,3,0) + Y$3*VLOOKUP(Y$2,'Technische Daten'!$A:$G,4,0) + Y$3*VLOOKUP(Y$2,'Technische Daten'!$A:$G,5,0),0)","v":0},{"$f":"IF(Z$3<>\"\",$B$3 * Z$3*VLOOKUP(Z$2,'Technische Daten'!$A:$G,3,0) + Z$3*VLOOKUP(Z$2,'Technische Daten'!$A:$G,4,0) + Z$3*VLOOKUP(Z$2,'Technische Daten'!$A:$G,5,0),0)","v":0},{"$f":"IF(AA$3<>\"\",$B$3 * AA$3*VLOOKUP(AA$2,'Technische Daten'!$A:$G,3,0) + AA$3*VLOOKUP(AA$2,'Technische Daten'!$A:$G,4,0) + AA$3*VLOOKUP(AA$2,'Technische Daten'!$A:$G,5,0),0)","v":0},{"$f":"IF(AB$3<>\"\",$B$3 * AB$3*VLOOKUP(AB$2,'Technische Daten'!$A:$G,3,0) + AB$3*VLOOKUP(AB$2,'Technische Daten'!$A:$G,4,0) + AB$3*VLOOKUP(AB$2,'Technische Daten'!$A:$G,5,0),0)","v":0},{"$f":"IF(AC$3<>\"\",$B$3 * AC$3*VLOOKUP(AC$2,'Technische Daten'!$A:$G,3,0) + AC$3*VLOOKUP(AC$2,'Technische Daten'!$A:$G,4,0) + AC$3*VLOOKUP(AC$2,'Technische Daten'!$A:$G,5,0),0)","v":0},{"$f":"IF(AD$3<>\"\",$B$3 * AD$3*VLOOKUP(AD$2,'Technische Daten'!$A:$G,3,0) + AD$3*VLOOKUP(AD$2,'Technische Daten'!$A:$G,4,0) + AD$3*VLOOKUP(AD$2,'Technische Daten'!$A:$G,5,0),0)","v":0},{"$f":"IF(AE$3<>\"\",$B$3 * AE$3*VLOOKUP(AE$2,'Technische Daten'!$A:$G,3,0) + AE$3*VLOOKUP(AE$2,'Technische Daten'!$A:$G,4,0) + AE$3*VLOOKUP(AE$2,'Technische Daten'!$A:$G,5,0),0)","v":0},{"$f":"IF(AF$3<>\"\",$B$3 * AF$3*VLOOKUP(AF$2,'Technische Daten'!$A:$G,3,0) + AF$3*VLOOKUP(AF$2,'Technische Daten'!$A:$G,4,0) + AF$3*VLOOKUP(AF$2,'Technische Daten'!$A:$G,5,0),0)","v":0},{"$f":"IF(AG$3<>\"\",$B$3 * AG$3*VLOOKUP(AG$2,'Technische Daten'!$A:$G,3,0) + AG$3*VLOOKUP(AG$2,'Technische Daten'!$A:$G,4,0) + AG$3*VLOOKUP(AG$2,'Technische Daten'!$A:$G,5,0),0)","v":0},{"$f":"IF(AH$3<>\"\",$B$3 * AH$3*VLOOKUP(AH$2,'Technische Daten'!$A:$G,3,0) + AH$3*VLOOKUP(AH$2,'Technische Daten'!$A:$G,4,0) + AH$3*VLOOKUP(AH$2,'Technische Daten'!$A:$G,5,0),0)","v":0},{"$f":"IF(AI$3<>\"\",$B$3 * AI$3*VLOOKUP(AI$2,'Technische Daten'!$A:$G,3,0) + AI$3*VLOOKUP(AI$2,'Technische Daten'!$A:$G,4,0) + AI$3*VLOOKUP(AI$2,'Technische Daten'!$A:$G,5,0),0)","v":0},{"$f":"IF(AJ$3<>\"\",$B$3 * AJ$3*VLOOKUP(AJ$2,'Technische Daten'!$A:$G,3,0) + AJ$3*VLOOKUP(AJ$2,'Technische Daten'!$A:$G,4,0) + AJ$3*VLOOKUP(AJ$2,'Technische Daten'!$A:$G,5,0),0)","v":0},{"$f":"IF(AK$3<>\"\",$B$3 * AK$3*VLOOKUP(AK$2,'Technische Daten'!$A:$G,3,0) + AK$3*VLOOKUP(AK$2,'Technische Daten'!$A:$G,4,0) + AK$3*VLOOKUP(AK$2,'Technische Daten'!$A:$G,5,0),0)","v":0},{"$f":"IF(AL$3<>\"\",$B$3 * AL$3*VLOOKUP(AL$2,'Technische Daten'!$A:$G,3,0) + AL$3*VLOOKUP(AL$2,'Technische Daten'!$A:$G,4,0) + AL$3*VLOOKUP(AL$2,'Technische Daten'!$A:$G,5,0),0)","v":0},{"$f":"IF(AM$3<>\"\",$B$3 * AM$3*VLOOKUP(AM$2,'Technische Daten'!$A:$G,3,0) + AM$3*VLOOKUP(AM$2,'Technische Daten'!$A:$G,4,0) + AM$3*VLOOKUP(AM$2,'Technische Daten'!$A:$G,5,0),0)","v":0},{"$f":"IF(AN$3<>\"\",$B$3 * AN$3*VLOOKUP(AN$2,'Technische Daten'!$A:$G,3,0) + AN$3*VLOOKUP(AN$2,'Technische Daten'!$A:$G,4,0) + AN$3*VLOOKUP(AN$2,'Technische Daten'!$A:$G,5,0),0)","v":0},{"$f":"IF(AO$3<>\"\",$B$3 * AO$3*VLOOKUP(AO$2,'Technische Daten'!$A:$G,3,0) + AO$3*VLOOKUP(AO$2,'Technische Daten'!$A:$G,4,0) + AO$3*VLOOKUP(AO$2,'Technische Daten'!$A:$G,5,0),0)","v":0},{"$f":"IF(AP$3<>\"\",$B$3 * AP$3*VLOOKUP(AP$2,'Technische Daten'!$A:$G,3,0) + AP$3*VLOOKUP(AP$2,'Technische Daten'!$A:$G,4,0) + AP$3*VLOOKUP(AP$2,'Technische Daten'!$A:$G,5,0),0)","v":0},{"$f":"IF(AQ$3<>\"\",$B$3 * AQ$3*VLOOKUP(AQ$2,'Technische Daten'!$A:$G,3,0) + AQ$3*VLOOKUP(AQ$2,'Technische Daten'!$A:$G,4,0) + AQ$3*VLOOKUP(AQ$2,'Technische Daten'!$A:$G,5,0),0)","v":0},{"$f":"IF(AR$3<>\"\",$B$3 * AR$3*VLOOKUP(AR$2,'Technische Daten'!$A:$G,3,0) + AR$3*VLOOKUP(AR$2,'Technische Daten'!$A:$G,4,0) + AR$3*VLOOKUP(AR$2,'Technische Daten'!$A:$G,5,0),0)","v":0},{"$f":"IF(AS$3<>\"\",$B$3 * AS$3*VLOOKUP(AS$2,'Technische Daten'!$A:$G,3,0) + AS$3*VLOOKUP(AS$2,'Technische Daten'!$A:$G,4,0) + AS$3*VLOOKUP(AS$2,'Technische Daten'!$A:$G,5,0),0)","v":0},{"$f":"IF(AT$3<>\"\",$B$3 * AT$3*VLOOKUP(AT$2,'Technische Daten'!$A:$G,3,0) + AT$3*VLOOKUP(AT$2,'Technische Daten'!$A:$G,4,0) + AT$3*VLOOKUP(AT$2,'Technische Daten'!$A:$G,5,0),0)","v":0},{"$f":"IF(AU$3<>\"\",AU$3*VLOOKUP(AU$2,'Technische Daten'!$A:$G,3,0) + VLOOKUP(AU$2,'Technische Daten'!$A:$G,4,0) + VLOOKUP(AU$2,'Technische Daten'!$A:$G,5,0),0)","v":0},{"$f":"IF(AV$3<>\"\",AV$3*VLOOKUP(AV$2,'Technische Daten'!$A:$G,3,0) + VLOOKUP(AV$2,'Technische Daten'!$A:$G,4,0) + VLOOKUP(AV$2,'Technische Daten'!$A:$G,5,0),0)","v":0},{"$f":"IF(AW$3<>\"\",AW$3*VLOOKUP(AW$2,'Technische Daten'!$A:$G,3,0) + VLOOKUP(AW$2,'Technische Daten'!$A:$G,4,0) + VLOOKUP(AW$2,'Technische Daten'!$A:$G,5,0),0)","v":0},{"$f":"IF(AX$3<>\"\",AX$3*VLOOKUP(AX$2,'Technische Daten'!$A:$G,3,0) + VLOOKUP(AX$2,'Technische Daten'!$A:$G,4,0) + VLOOKUP(AX$2,'Technische Daten'!$A:$G,5,0),0)","v":0}]
[{"$f":"Texte!B9","v":"Einspeisestrom I/O (A)"},{"$f":"(SUM(C14:I14)+SUM(AU14:AX14))/1000","v":0}]
[{"$f":"Texte!B10","v":"benötigte Powermodule EPM-S701"},{"$f":"IF(SUM(C14:AT14)+$AX14<0,ROUNDUP((SUM(C14:AT14)*(-1)-$AX14)/VLOOKUP($AV$2,'Technische Daten'!$A:$G,3,0),0),0)","v":0}]
[{"$f":"Texte!B11","v":"Konfigurationscheck"},{"$f":"IF((B15-B14) >= 0,\"OK\",\"NOK\")","v":"OK"}]
[]
[{"$f":"Texte!B17","v":"Kommunikation (CAN) Drive-based"}]
[{"$f":"Texte!B19","v":"Anzahl verbleibende Tx-PDO (Byte)"},{"$f":"C20/8+B77+B79+B81+IF(B77<>0,8,0)+IF(B79<>0,8,0)","v":0},{"$f":"IF(C$3<>\"\",C$3*VLOOKUP(C$2,'Technische Daten'!$A:$P,15,0),0)","v":0},{"$f":"IF(D$3<>\"\",D$3*VLOOKUP(D$2,'Technische Daten'!$A:$P,15,0),0)","v":0},{"$f":"IF(E$3<>\"\",E$3*VLOOKUP(E$2,'Technische Daten'!$A:$P,15,0),0)","v":0},{"$f":"IF(F$3<>\"\",F$3*VLOOKUP(F$2,'Technische Daten'!$A:$P,15,0),0)","v":0},{"$f":"IF(G$3<>\"\",G$3*VLOOKUP(G$2,'Technische Daten'!$A:$P,15,0),0)","v":0},{"$f":"IF(H$3<>\"\",H$3*VLOOKUP(H$2,'Technische Daten'!$A:$P,15,0),0)","v":0},{"$f":"IF(I$3<>\"\",I$3*VLOOKUP(I$2,'Technische Daten'!$A:$P,15,0),0)","v":0},{"$f":"IF(J$3<>\"\",J$3*VLOOKUP(J$2,'Technische Daten'!$A:$P,15,0),0)","v":0},{"$f":"IF(K$3<>\"\",K$3*VLOOKUP(K$2,'Technische Daten'!$A:$P,15,0),0)","v":0},{"$f":"IF(L$3<>\"\",L$3*VLOOKUP(L$2,'Technische Daten'!$A:$P,15,0),0)","v":0},{"$f":"IF(M$3<>\"\",M$3*VLOOKUP(M$2,'Technische Daten'!$A:$P,15,0),0)","v":0},{"$f":"IF(N$3<>\"\",N$3*VLOOKUP(N$2,'Technische Daten'!$A:$P,15,0),0)","v":0},{"$f":"IF(O$3<>\"\",O$3*VLOOKUP(O$2,'Technische Daten'!$A:$P,15,0),0)","v":0},{"$f":"IF(P$3<>\"\",P$3*VLOOKUP(P$2,'Technische Daten'!$A:$P,15,0),0)","v":0},{"$f":"IF(Q$3<>\"\",Q$3*VLOOKUP(Q$2,'Technische Daten'!$A:$P,15,0),0)","v":0},{"$f":"IF(R$3<>\"\",R$3*VLOOKUP(R$2,'Technische Daten'!$A:$P,15,0),0)","v":0},{"$f":"IF(S$3<>\"\",S$3*VLOOKUP(S$2,'Technische Daten'!$A:$P,15,0),0)","v":0},{"$f":"IF(T$3<>\"\",T$3*VLOOKUP(T$2,'Technische Daten'!$A:$P,15,0),0)","v":0},{"$f":"IF(U$3<>\"\",U$3*VLOOKUP(U$2,'Technische Daten'!$A:$P,15,0),0)","v":0},{"$f":"IF(V$3<>\"\",V$3*VLOOKUP(V$2,'Technische Daten'!$A:$P,15,0),0)","v":0},{"$f":"IF(W$3<>\"\",W$3*VLOOKUP(W$2,'Technische Daten'!$A:$P,15,0),0)","v":0},{"$f":"IF(X$3<>\"\",X$3*VLOOKUP(X$2,'Technische Daten'!$A:$P,15,0),0)","v":0},{"$f":"IF(Y$3<>\"\",Y$3*VLOOKUP(Y$2,'Technische Daten'!$A:$P,15,0),0)","v":0},{"$f":"IF(Z$3<>\"\",Z$3*VLOOKUP(Z$2,'Technische Daten'!$A:$P,15,0),0)","v":0},{"$f":"IF(AA$3<>\"\",AA$3*VLOOKUP(AA$2,'Technische Daten'!$A:$P,15,0),0)","v":0},{"$f":"IF(AB$3<>\"\",AB$3*VLOOKUP(AB$2,'Technische Daten'!$A:$P,15,0),0)","v":0},{"$f":"IF(AC$3<>\"\",AC$3*VLOOKUP(AC$2,'Technische Daten'!$A:$P,15,0),0)","v":0},{"$f":"IF(AD$3<>\"\",AD$3*VLOOKUP(AD$2,'Technische Daten'!$A:$P,15,0),0)","v":0},{"$f":"IF(AE$3<>\"\",AE$3*VLOOKUP(AE$2,'Technische Daten'!$A:$P,15,0),0)","v":0},{"$f":"IF(AF$3<>\"\",AF$3*VLOOKUP(AF$2,'Technische Daten'!$A:$P,15,0),0)","v":0},{"$f":"IF(AG$3<>\"\",AG$3*VLOOKUP(AG$2,'Technische Daten'!$A:$P,15,0),0)","v":0},{"$f":"IF(AH$3<>\"\",AH$3*VLOOKUP(AH$2,'Technische Daten'!$A:$P,15,0),0)","v":0},{"$f":"IF(AI$3<>\"\",AI$3*VLOOKUP(AI$2,'Technische Daten'!$A:$P,15,0),0)","v":0},{"$f":"IF(AJ$3<>\"\",AJ$3*VLOOKUP(AJ$2,'Technische Daten'!$A:$P,15,0),0)","v":0},{"$f":"IF(AK$3<>\"\",AK$3*VLOOKUP(AK$2,'Technische Daten'!$A:$P,15,0),0)","v":0},{"$f":"IF(AL$3<>\"\",AL$3*VLOOKUP(AL$2,'Technische Daten'!$A:$P,15,0),0)","v":0},{"$f":"IF(AM$3<>\"\",AM$3*VLOOKUP(AM$2,'Technische Daten'!$A:$P,15,0),0)","v":0},{"$f":"IF(AN$3<>\"\",AN$3*VLOOKUP(AN$2,'Technische Daten'!$A:$P,15,0),0)","v":0},{"$f":"IF(AO$3<>\"\",AO$3*VLOOKUP(AO$2,'Technische Daten'!$A:$P,15,0),0)","v":0},{"$f":"IF(AP$3<>\"\",AP$3*VLOOKUP(AP$2,'Technische Daten'!$A:$P,15,0),0)","v":0},{"$f":"IF(AQ$3<>\"\",AQ$3*VLOOKUP(AQ$2,'Technische Daten'!$A:$P,15,0),0)","v":0},{"$f":"IF(AR$3<>\"\",AR$3*VLOOKUP(AR$2,'Technische Daten'!$A:$P,15,0),0)","v":0},{"$f":"IF(AS$3<>\"\",AS$3*VLOOKUP(AS$2,'Technische Daten'!$A:$P,15,0),0)","v":0},{"$f":"IF(AT$3<>\"\",AT$3*VLOOKUP(AT$2,'Technische Daten'!$A:$P,15,0),0)","v":0},{"$f":"IF(AU$3<>\"\",AU$3*VLOOKUP(AU$2,'Technische Daten'!$A:$P,15,0),0)","v":0},{"$f":"IF(AV$3<>\"\",AV$3*VLOOKUP(AV$2,'Technische Daten'!$A:$P,15,0),0)","v":0},{"$f":"IF(AW$3<>\"\",AW$3*VLOOKUP(AW$2,'Technische Daten'!$A:$P,15,0),0)","v":0},{"$f":"IF(AX$3<>\"\",AX$3*VLOOKUP(AX$2,'Technische Daten'!$A:$P,15,0),0)","v":0}]
[{"$f":"Texte!B18","v":"Anzahl verbleibende Rx-PDO (Byte)"},{"$f":"C21/8+B78+B80+B82+IF(B78<>0,8,0)+IF(B80<>0,8,0)","v":0},{"$f":"IF(C$3<>\"\",C$3*VLOOKUP(C$2,'Technische Daten'!$A:$P,16,0),0)","v":0},{"$f":"IF(D$3<>\"\",D$3*VLOOKUP(D$2,'Technische Daten'!$A:$P,16,0),0)","v":0},{"$f":"IF(E$3<>\"\",E$3*VLOOKUP(E$2,'Technische Daten'!$A:$P,16,0),0)","v":0},{"$f":"IF(F$3<>\"\",F$3*VLOOKUP(F$2,'Technische Daten'!$A:$P,16,0),0)","v":0},{"$f":"IF(G$3<>\"\",G$3*VLOOKUP(G$2,'Technische Daten'!$A:$P,16,0),0)","v":0},{"$f":"IF(H$3<>\"\",H$3*VLOOKUP(H$2,'Technische Daten'!$A:$P,16,0),0)","v":0},{"$f":"IF(I$3<>\"\",I$3*VLOOKUP(I$2,'Technische Daten'!$A:$P,16,0),0)","v":0},{"$f":"IF(J$3<>\"\",J$3*VLOOKUP(J$2,'Technische Daten'!$A:$P,16,0),0)","v":0},{"$f":"IF(K$3<>\"\",K$3*VLOOKUP(K$2,'Technische Daten'!$A:$P,16,0),0)","v":0},{"$f":"IF(L$3<>\"\",L$3*VLOOKUP(L$2,'Technische Daten'!$A:$P,16,0),0)","v":0},{"$f":"IF(M$3<>\"\",M$3*VLOOKUP(M$2,'Technische Daten'!$A:$P,16,0),0)","v":0},{"$f":"IF(N$3<>\"\",N$3*VLOOKUP(N$2,'Technische Daten'!$A:$P,16,0),0)","v":0},{"$f":"IF(O$3<>\"\",O$3*VLOOKUP(O$2,'Technische Daten'!$A:$P,16,0),0)","v":0},{"$f":"IF(P$3<>\"\",P$3*VLOOKUP(P$2,'Technische Daten'!$A:$P,16,0),0)","v":0},{"$f":"IF(Q$3<>\"\",Q$3*VLOOKUP(Q$2,'Technische Daten'!$A:$P,16,0),0)","v":0},{"$f":"IF(R$3<>\"\",R$3*VLOOKUP(R$2,'Technische Daten'!$A:$P,16,0),0)","v":0},{"$f":"IF(S$3<>\"\",S$3*VLOOKUP(S$2,'Technische Daten'!$A:$P,16,0),0)","v":0},{"$f":"IF(T$3<>\"\",T$3*VLOOKUP(T$2,'Technische Daten'!$A:$P,16,0),0)","v":0},{"$f":"IF(U$3<>\"\",U$3*VLOOKUP(U$2,'Technische Daten'!$A:$P,16,0),0)","v":0},{"$f":"IF(V$3<>\"\",V$3*VLOOKUP(V$2,'Technische Daten'!$A:$P,16,0),0)","v":0},{"$f":"IF(W$3<>\"\",W$3*VLOOKUP(W$2,'Technische Daten'!$A:$P,16,0),0)","v":0},{"$f":"IF(X$3<>\"\",X$3*VLOOKUP(X$2,'Technische Daten'!$A:$P,16,0),0)","v":0},{"$f":"IF(Y$3<>\"\",Y$3*VLOOKUP(Y$2,'Technische Daten'!$A:$P,16,0),0)","v":0},{"$f":"IF(Z$3<>\"\",Z$3*VLOOKUP(Z$2,'Technische Daten'!$A:$P,16,0),0)","v":0},{"$f":"IF(AA$3<>\"\",AA$3*VLOOKUP(AA$2,'Technische Daten'!$A:$P,16,0),0)","v":0},{"$f":"IF(AB$3<>\"\",AB$3*VLOOKUP(AB$2,'Technische Daten'!$A:$P,16,0),0)","v":0},{"$f":"IF(AC$3<>\"\",AC$3*VLOOKUP(AC$2,'Technische Daten'!$A:$P,16,0),0)","v":0},{"$f":"IF(AD$3<>\"\",AD$3*VLOOKUP(AD$2,'Technische Daten'!$A:$P,16,0),0)","v":0},{"$f":"IF(AE$3<>\"\",AE$3*VLOOKUP(AE$2,'Technische Daten'!$A:$P,16,0),0)","v":0},{"$f":"IF(AF$3<>\"\",AF$3*VLOOKUP(AF$2,'Technische Daten'!$A:$P,16,0),0)","v":0},{"$f":"IF(AG$3<>\"\",AG$3*VLOOKUP(AG$2,'Technische Daten'!$A:$P,16,0),0)","v":0},{"$f":"IF(AH$3<>\"\",AH$3*VLOOKUP(AH$2,'Technische Daten'!$A:$P,16,0),0)","v":0},{"$f":"IF(AI$3<>\"\",AI$3*VLOOKUP(AI$2,'Technische Daten'!$A:$P,16,0),0)","v":0},{"$f":"IF(AJ$3<>\"\",AJ$3*VLOOKUP(AJ$2,'Technische Daten'!$A:$P,16,0),0)","v":0},{"$f":"IF(AK$3<>\"\",AK$3*VLOOKUP(AK$2,'Technische Daten'!$A:$P,16,0),0)","v":0},{"$f":"IF(AL$3<>\"\",AL$3*VLOOKUP(AL$2,'Technische Daten'!$A:$P,16,0),0)","v":0},{"$f":"IF(AM$3<>\"\",AM$3*VLOOKUP(AM$2,'Technische Daten'!$A:$P,16,0),0)","v":0},{"$f":"IF(AN$3<>\"\",AN$3*VLOOKUP(AN$2,'Technische Daten'!$A:$P,16,0),0)","v":0},{"$f":"IF(AO$3<>\"\",AO$3*VLOOKUP(AO$2,'Technische Daten'!$A:$P,16,0),0)","v":0},{"$f":"IF(AP$3<>\"\",AP$3*VLOOKUP(AP$2,'Technische Daten'!$A:$P,16,0),0)","v":0},{"$f":"IF(AQ$3<>\"\",AQ$3*VLOOKUP(AQ$2,'Technische Daten'!$A:$P,16,0),0)","v":0},{"$f":"IF(AR$3<>\"\",AR$3*VLOOKUP(AR$2,'Technische Daten'!$A:$P,16,0),0)","v":0},{"$f":"IF(AS$3<>\"\",AS$3*VLOOKUP(AS$2,'Technische Daten'!$A:$P,16,0),0)","v":0},{"$f":"IF(AT$3<>\"\",AT$3*VLOOKUP(AT$2,'Technische Daten'!$A:$P,16,0),0)","v":0},{"$f":"IF(AU$3<>\"\",AU$3*VLOOKUP(AU$2,'Technische Daten'!$A:$P,16,0),0)","v":0},{"$f":"IF(AV$3<>\"\",AV$3*VLOOKUP(AV$2,'Technische Daten'!$A:$P,16,0),0)","v":0},{"$f":"IF(AW$3<>\"\",AW$3*VLOOKUP(AW$2,'Technische Daten'!$A:$P,16,0),0)","v":0},{"$f":"IF(AX$3<>\"\",AX$3*VLOOKUP(AX$2,'Technische Daten'!$A:$P,16,0),0)","v":0}]
[{"$f":"Texte!B11","v":"Konfigurationscheck"},{"$f":"IF(AND(B20>=0, B21>=0),\"OK\",\"NOK\")","v":"OK"}]
[]
[{"$f":"Texte!B12","v":"Kommunikation (CAN) Controller-based"}]
[{"$f":"Texte!B14","v":"Anzahl verbleibende Tx-PDO (Byte)"},{"$f":"IF(SUM(C25:AX25)>0,ROUNDDOWN(SUM(C25:AX25)/8,0),ROUNDUP(SUM(C25:AX25)/8,0))","v":0},{"$f":"IF(C$3<>\"\",C$3*VLOOKUP(C$2,'Technische Daten'!$A:$G,6,0),0)","v":0},{"$f":"IF(D$3<>\"\",D$3*VLOOKUP(D$2,'Technische Daten'!$A:$G,6,0),0)","v":0},{"$f":"IF(E$3<>\"\",E$3*VLOOKUP(E$2,'Technische Daten'!$A:$G,6,0),0)","v":0},{"$f":"IF(F$3<>\"\",F$3*VLOOKUP(F$2,'Technische Daten'!$A:$G,6,0),0)","v":0},{"$f":"IF(G$3<>\"\",G$3*VLOOKUP(G$2,'Technische Daten'!$A:$G,6,0),0)","v":0},{"$f":"IF(H$3<>\"\",H$3*VLOOKUP(H$2,'Technische Daten'!$A:$G,6,0),0)","v":0},{"$f":"IF(I$3<>\"\",I$3*VLOOKUP(I$2,'Technische Daten'!$A:$G,6,0),0)","v":0},{"$f":"IF(J$3<>\"\",J$3*VLOOKUP(J$2,'Technische Daten'!$A:$G,6,0),0)","v":0},{"$f":"IF(K$3<>\"\",K$3*VLOOKUP(K$2,'Technische Daten'!$A:$G,6,0),0)","v":0},{"$f":"IF(L$3<>\"\",L$3*VLOOKUP(L$2,'Technische Daten'!$A:$G,6,0),0)","v":0},{"$f":"IF(M$3<>\"\",M$3*VLOOKUP(M$2,'Technische Daten'!$A:$G,6,0),0)","v":0},{"$f":"IF(N$3<>\"\",N$3*VLOOKUP(N$2,'Technische Daten'!$A:$G,6,0),0)","v":0},{"$f":"IF(O$3<>\"\",O$3*VLOOKUP(O$2,'Technische Daten'!$A:$G,6,0),0)","v":0},{"$f":"IF(P$3<>\"\",P$3*VLOOKUP(P$2,'Technische Daten'!$A:$G,6,0),0)","v":0},{"$f":"IF(Q$3<>\"\",Q$3*VLOOKUP(Q$2,'Technische Daten'!$A:$G,6,0),0)","v":0},{"$f":"IF(R$3<>\"\",R$3*VLOOKUP(R$2,'Technische Daten'!$A:$G,6,0),0)","v":0},{"$f":"IF(S$3<>\"\",S$3*VLOOKUP(S$2,'Technische Daten'!$A:$G,6,0),0)","v":0},{"$f":"IF(T$3<>\"\",T$3*VLOOKUP(T$2,'Technische Daten'!$A:$G,6,0),0)","v":0},{"$f":"IF(U$3<>\"\",U$3*VLOOKUP(U$2,'Technische Daten'!$A:$G,6,0),0)","v":0},{"$f":"IF(V$3<>\"\",V$3*VLOOKUP(V$2,'Technische Daten'!$A:$G,6,0),0)","v":0},{"$f":"IF(W$3<>\"\",W$3*VLOOKUP(W$2,'Technische Daten'!$A:$G,6,0),0)","v":0},{"$f":"IF(X$3<>\"\",X$3*VLOOKUP(X$2,'Technische Daten'!$A:$G,6,0),0)","v":0},{"$f":"IF(Y$3<>\"\",Y$3*VLOOKUP(Y$2,'Technische Daten'!$A:$G,6,0),0)","v":0},{"$f":"IF(Z$3<>\"\",Z$3*VLOOKUP(Z$2,'Technische Daten'!$A:$G,6,0),0)","v":0},{"$f":"IF(AA$3<>\"\",AA$3*VLOOKUP(AA$2,'Technische Daten'!$A:$G,6,0),0)","v":0},{"$f":"IF(AB$3<>\"\",AB$3*VLOOKUP(AB$2,'Technische Daten'!$A:$G,6,0),0)","v":0},{"$f":"IF(AC$3<>\"\",AC$3*VLOOKUP(AC$2,'Technische Daten'!$A:$G,6,0),0)","v":0},{"$f":"IF(AD$3<>\"\",AD$3*VLOOKUP(AD$2,'Technische Daten'!$A:$G,6,0),0)","v":0},{"$f":"IF(AE$3<>\"\",AE$3*VLOOKUP(AE$2,'Technische Daten'!$A:$G,6,0),0)","v":0},{"$f":"IF(AF$3<>\"\",AF$3*VLOOKUP(AF$2,'Technische Daten'!$A:$G,6,0),0)","v":0},{"$f":"IF(AG$3<>\"\",AG$3*VLOOKUP(AG$2,'Technische Daten'!$A:$G,6,0),0)","v":0},{"$f":"IF(AH$3<>\"\",AH$3*VLOOKUP(AH$2,'Technische Daten'!$A:$G,6,0),0)","v":0},{"$f":"IF(AI$3<>\"\",AI$3*VLOOKUP(AI$2,'Technische Daten'!$A:$G,6,0),0)","v":0},{"$f":"IF(AJ$3<>\"\",AJ$3*VLOOKUP(AJ$2,'Technische Daten'!$A:$G,6,0),0)","v":0},{"$f":"IF(AK$3<>\"\",AK$3*VLOOKUP(AK$2,'Technische Daten'!$A:$G,6,0),0)","v":0},{"$f":"IF(AL$3<>\"\",AL$3*VLOOKUP(AL$2,'Technische Daten'!$A:$G,6,0),0)","v":0},{"$f":"IF(AM$3<>\"\",AM$3*VLOOKUP(AM$2,'Technische Daten'!$A:$G,6,0),0)","v":0},{"$f":"IF(AN$3<>\"\",AN$3*VLOOKUP(AN$2,'Technische Daten'!$A:$G,6,0),0)","v":0},{"$f":"IF(AO$3<>\"\",AO$3*VLOOKUP(AO$2,'Technische Daten'!$A:$G,6,0),0)","v":0},{"$f":"IF(AP$3<>\"\",AP$3*VLOOKUP(AP$2,'Technische Daten'!$A:$G,6,0),0)","v":0},{"$f":"IF(AQ$3<>\"\",AQ$3*VLOOKUP(AQ$2,'Technische Daten'!$A:$G,6,0),0)","v":0},{"$f":"IF(AR$3<>\"\",AR$3*VLOOKUP(AR$2,'Technische Daten'!$A:$G,6,0),0)","v":0},{"$f":"IF(AS$3<>\"\",AS$3*VLOOKUP(AS$2,'Technische Daten'!$A:$G,6,0),0)","v":0},{"$f":"IF(AT$3<>\"\",AT$3*VLOOKUP(AT$2,'Technische Daten'!$A:$G,6,0),0)","v":0},{"$f":"IF(AU$3<>\"\",AU$3*VLOOKUP(AU$2,'Technische Daten'!$A:$G,6,0),0)","v":0},{"$f":"IF(AV$3<>\"\",AV$3*VLOOKUP(AV$2,'Technische Daten'!$A:$G,6,0),0)","v":0},{"$f":"IF(AW$3<>\"\",AW$3*VLOOKUP(AW$2,'Technische Daten'!$A:$G,6,0),0)","v":0},{"$f":"IF(AX$3<>\"\",AX$3*VLOOKUP(AX$2,'Technische Daten'!$A:$G,6,0),0)","v":0}]
[{"$f":"Texte!B13","v":"Anzahl verbleibende Rx-PDO (Byte)"},{"$f":"IF(SUM(C26:AX26)>0,ROUNDDOWN(SUM(C26:AX26)/8,0),ROUNDUP(SUM(C26:AX26)/8,0))","v":0},{"$f":"IF(C$3<>\"\",C$3*VLOOKUP(C$2,'Technische Daten'!$A:$G,7,0),0)","v":0},{"$f":"IF(D$3<>\"\",D$3*VLOOKUP(D$2,'Technische Daten'!$A:$G,7,0),0)","v":0},{"$f":"IF(E$3<>\"\",E$3*VLOOKUP(E$2,'Technische Daten'!$A:$G,7,0),0)","v":0},{"$f":"IF(F$3<>\"\",F$3*VLOOKUP(F$2,'Technische Daten'!$A:$G,7,0),0)","v":0},{"$f":"IF(G$3<>\"\",G$3*VLOOKUP(G$2,'Technische Daten'!$A:$G,7,0),0)","v":0},{"$f":"IF(H$3<>\"\",H$3*VLOOKUP(H$2,'Technische Daten'!$A:$G,7,0),0)","v":0},{"$f":"IF(I$3<>\"\",I$3*VLOOKUP(I$2,'Technische Daten'!$A:$G,7,0),0)","v":0},{"$f":"IF(J$3<>\"\",J$3*VLOOKUP(J$2,'Technische Daten'!$A:$G,7,0),0)","v":0},{"$f":"IF(K$3<>\"\",K$3*VLOOKUP(K$2,'Technische Daten'!$A:$G,7,0),0)","v":0},{"$f":"IF(L$3<>\"\",L$3*VLOOKUP(L$2,'Technische Daten'!$A:$G,7,0),0)","v":0},{"$f":"IF(M$3<>\"\",M$3*VLOOKUP(M$2,'Technische Daten'!$A:$G,7,0),0)","v":0},{"$f":"IF(N$3<>\"\",N$3*VLOOKUP(N$2,'Technische Daten'!$A:$G,7,0),0)","v":0},{"$f":"IF(O$3<>\"\",O$3*VLOOKUP(O$2,'Technische Daten'!$A:$G,7,0),0)","v":0},{"$f":"IF(P$3<>\"\",P$3*VLOOKUP(P$2,'Technische Daten'!$A:$G,7,0),0)","v":0},{"$f":"IF(Q$3<>\"\",Q$3*VLOOKUP(Q$2,'Technische Daten'!$A:$G,7,0),0)","v":0},{"$f":"IF(R$3<>\"\",R$3*VLOOKUP(R$2,'Technische Daten'!$A:$G,7,0),0)","v":0},{"$f":"IF(S$3<>\"\",S$3*VLOOKUP(S$2,'Technische Daten'!$A:$G,7,0),0)","v":0},{"$f":"IF(T$3<>\"\",T$3*VLOOKUP(T$2,'Technische Daten'!$A:$G,7,0),0)","v":0},{"$f":"IF(U$3<>\"\",U$3*VLOOKUP(U$2,'Technische Daten'!$A:$G,7,0),0)","v":0},{"$f":"IF(V$3<>\"\",V$3*VLOOKUP(V$2,'Technische Daten'!$A:$G,7,0),0)","v":0},{"$f":"IF(W$3<>\"\",W$3*VLOOKUP(W$2,'Technische Daten'!$A:$G,7,0),0)","v":0},{"$f":"IF(X$3<>\"\",X$3*VLOOKUP(X$2,'Technische Daten'!$A:$G,7,0),0)","v":0},{"$f":"IF(Y$3<>\"\",Y$3*VLOOKUP(Y$2,'Technische Daten'!$A:$G,7,0),0)","v":0},{"$f":"IF(Z$3<>\"\",Z$3*VLOOKUP(Z$2,'Technische Daten'!$A:$G,7,0),0)","v":0},{"$f":"IF(AA$3<>\"\",AA$3*VLOOKUP(AA$2,'Technische Daten'!$A:$G,7,0),0)","v":0},{"$f":"IF(AB$3<>\"\",AB$3*VLOOKUP(AB$2,'Technische Daten'!$A:$G,7,0),0)","v":0},{"$f":"IF(AC$3<>\"\",AC$3*VLOOKUP(AC$2,'Technische Daten'!$A:$G,7,0),0)","v":0},{"$f":"IF(AD$3<>\"\",AD$3*VLOOKUP(AD$2,'Technische Daten'!$A:$G,7,0),0)","v":0},{"$f":"IF(AE$3<>\"\",AE$3*VLOOKUP(AE$2,'Technische Daten'!$A:$G,7,0),0)","v":0},{"$f":"IF(AF$3<>\"\",AF$3*VLOOKUP(AF$2,'Technische Daten'!$A:$G,7,0),0)","v":0},{"$f":"IF(AG$3<>\"\",AG$3*VLOOKUP(AG$2,'Technische Daten'!$A:$G,7,0),0)","v":0},{"$f":"IF(AH$3<>\"\",AH$3*VLOOKUP(AH$2,'Technische Daten'!$A:$G,7,0),0)","v":0},{"$f":"IF(AI$3<>\"\",AI$3*VLOOKUP(AI$2,'Technische Daten'!$A:$G,7,0),0)","v":0},{"$f":"IF(AJ$3<>\"\",AJ$3*VLOOKUP(AJ$2,'Technische Daten'!$A:$G,7,0),0)","v":0},{"$f":"IF(AK$3<>\"\",AK$3*VLOOKUP(AK$2,'Technische Daten'!$A:$G,7,0),0)","v":0},{"$f":"IF(AL$3<>\"\",AL$3*VLOOKUP(AL$2,'Technische Daten'!$A:$G,7,0),0)","v":0},{"$f":"IF(AM$3<>\"\",AM$3*VLOOKUP(AM$2,'Technische Daten'!$A:$G,7,0),0)","v":0},{"$f":"IF(AN$3<>\"\",AN$3*VLOOKUP(AN$2,'Technische Daten'!$A:$G,7,0),0)","v":0},{"$f":"IF(AO$3<>\"\",AO$3*VLOOKUP(AO$2,'Technische Daten'!$A:$G,7,0),0)","v":0},{"$f":"IF(AP$3<>\"\",AP$3*VLOOKUP(AP$2,'Technische Daten'!$A:$G,7,0),0)","v":0},{"$f":"IF(AQ$3<>\"\",AQ$3*VLOOKUP(AQ$2,'Technische Daten'!$A:$G,7,0),0)","v":0},{"$f":"IF(AR$3<>\"\",AR$3*VLOOKUP(AR$2,'Technische Daten'!$A:$G,7,0),0)","v":0},{"$f":"IF(AS$3<>\"\",AS$3*VLOOKUP(AS$2,'Technische Daten'!$A:$G,7,0),0)","v":0},{"$f":"IF(AT$3<>\"\",AT$3*VLOOKUP(AT$2,'Technische Daten'!$A:$G,7,0),0)","v":0},{"$f":"IF(AU$3<>\"\",AU$3*VLOOKUP(AU$2,'Technische Daten'!$A:$G,7,0),0)","v":0},{"$f":"IF(AV$3<>\"\",AV$3*VLOOKUP(AV$2,'Technische Daten'!$A:$G,7,0),0)","v":0},{"$f":"IF(AW$3<>\"\",AW$3*VLOOKUP(AW$2,'Technische Daten'!$A:$G,7,0),0)","v":0},{"$f":"IF(AX$3<>\"\",AX$3*VLOOKUP(AX$2,'Technische Daten'!$A:$G,7,0),0)","v":0}]
[{"$f":"Texte!B16","v":"Konfigurationscheck"},{"$f":"IF(AND(B25>=0, B26>=0),\"OK\",\"NOK\")","v":"OK"}]
[]
[{"$f":"Texte!B22","v":"Kommunikation (PROFIBUS)"}]
[{"$f":"Texte!B24","v":"Anzahl verbleibende Rx-PDO (Byte)"},{"$f":"IF(SUM(C30:AX30)>0,ROUNDDOWN(SUM(C30:AX30)/8,0),ROUNDUP(SUM(C30:AX30)/8,0))","v":0},{"$f":"IF(C$3<>\"\",C$3*VLOOKUP(C$2,'Technische Daten'!$A:$G,6,0),0)","v":0},{"$f":"IF(D$3<>\"\",D$3*VLOOKUP(D$2,'Technische Daten'!$A:$G,6,0),0)","v":0},{"$f":"IF(E$3<>\"\",E$3*VLOOKUP(E$2,'Technische Daten'!$A:$G,6,0),0)","v":0},{"$f":"IF(F$3<>\"\",F$3*VLOOKUP(F$2,'Technische Daten'!$A:$G,6,0),0)","v":0},{"$f":"IF(G$3<>\"\",G$3*VLOOKUP(G$2,'Technische Daten'!$A:$G,6,0),0)","v":0},{"$f":"IF(H$3<>\"\",H$3*VLOOKUP(H$2,'Technische Daten'!$A:$G,6,0),0)","v":0},{"$f":"IF(I$3<>\"\",I$3*VLOOKUP(I$2,'Technische Daten'!$A:$G,6,0),0)","v":0},{"$f":"IF(J$3<>\"\",J$3*VLOOKUP(J$2,'Technische Daten'!$A:$G,6,0),0)","v":0},{"$f":"IF(K$3<>\"\",K$3*VLOOKUP(K$2,'Technische Daten'!$A:$G,6,0),0)","v":0},{"$f":"IF(L$3<>\"\",L$3*VLOOKUP(L$2,'Technische Daten'!$A:$G,6,0),0)","v":0},{"$f":"IF(M$3<>\"\",M$3*VLOOKUP(M$2,'Technische Daten'!$A:$G,6,0),0)","v":0},{"$f":"IF(N$3<>\"\",N$3*VLOOKUP(N$2,'Technische Daten'!$A:$G,6,0),0)","v":0},{"$f":"IF(O$3<>\"\",O$3*VLOOKUP(O$2,'Technische Daten'!$A:$G,6,0),0)","v":0},{"$f":"IF(P$3<>\"\",P$3*VLOOKUP(P$2,'Technische Daten'!$A:$G,6,0),0)","v":0},{"$f":"IF(Q$3<>\"\",Q$3*VLOOKUP(Q$2,'Technische Daten'!$A:$G,6,0),0)","v":0},{"$f":"IF(R$3<>\"\",R$3*VLOOKUP(R$2,'Technische Daten'!$A:$G,6,0),0)","v":0},{"$f":"IF(S$3<>\"\",S$3*VLOOKUP(S$2,'Technische Daten'!$A:$G,6,0),0)","v":0},{"$f":"IF(T$3<>\"\",T$3*VLOOKUP(T$2,'Technische Daten'!$A:$G,6,0),0)","v":0},{"$f":"IF(U$3<>\"\",U$3*VLOOKUP(U$2,'Technische Daten'!$A:$G,6,0),0)","v":0},{"$f":"IF(V$3<>\"\",V$3*VLOOKUP(V$2,'Technische Daten'!$A:$G,6,0),0)","v":0},{"$f":"IF(W$3<>\"\",W$3*VLOOKUP(W$2,'Technische Daten'!$A:$G,6,0),0)","v":0},{"$f":"IF(X$3<>\"\",X$3*VLOOKUP(X$2,'Technische Daten'!$A:$G,6,0),0)","v":0},{"$f":"IF(Y$3<>\"\",Y$3*VLOOKUP(Y$2,'Technische Daten'!$A:$G,6,0),0)","v":0},{"$f":"IF(Z$3<>\"\",Z$3*VLOOKUP(Z$2,'Technische Daten'!$A:$G,6,0),0)","v":0},{"$f":"IF(AA$3<>\"\",AA$3*VLOOKUP(AA$2,'Technische Daten'!$A:$G,6,0),0)","v":0},{"$f":"IF(AB$3<>\"\",AB$3*VLOOKUP(AB$2,'Technische Daten'!$A:$G,6,0),0)","v":0},{"$f":"IF(AC$3<>\"\",AC$3*VLOOKUP(AC$2,'Technische Daten'!$A:$G,6,0),0)","v":0},{"$f":"IF(AD$3<>\"\",AD$3*VLOOKUP(AD$2,'Technische Daten'!$A:$G,6,0),0)","v":0},{"$f":"IF(AE$3<>\"\",AE$3*VLOOKUP(AE$2,'Technische Daten'!$A:$G,6,0),0)","v":0},{"$f":"IF(AF$3<>\"\",AF$3*VLOOKUP(AF$2,'Technische Daten'!$A:$G,6,0),0)","v":0},{"$f":"IF(AG$3<>\"\",AG$3*VLOOKUP(AG$2,'Technische Daten'!$A:$G,6,0),0)","v":0},{"$f":"IF(AH$3<>\"\",AH$3*VLOOKUP(AH$2,'Technische Daten'!$A:$G,6,0),0)","v":0},{"$f":"IF(AI$3<>\"\",AI$3*VLOOKUP(AI$2,'Technische Daten'!$A:$G,6,0),0)","v":0},{"$f":"IF(AJ$3<>\"\",AJ$3*VLOOKUP(AJ$2,'Technische Daten'!$A:$G,6,0),0)","v":0},{"$f":"IF(AK$3<>\"\",AK$3*VLOOKUP(AK$2,'Technische Daten'!$A:$G,6,0),0)","v":0},{"$f":"IF(AL$3<>\"\",AL$3*VLOOKUP(AL$2,'Technische Daten'!$A:$G,6,0),0)","v":0},{"$f":"IF(AM$3<>\"\",AM$3*VLOOKUP(AM$2,'Technische Daten'!$A:$G,6,0),0)","v":0},{"$f":"IF(AN$3<>\"\",AN$3*VLOOKUP(AN$2,'Technische Daten'!$A:$G,6,0),0)","v":0},{"$f":"IF(AO$3<>\"\",AO$3*VLOOKUP(AO$2,'Technische Daten'!$A:$G,6,0),0)","v":0},{"$f":"IF(AP$3<>\"\",AP$3*VLOOKUP(AP$2,'Technische Daten'!$A:$G,6,0),0)","v":0},{"$f":"IF(AQ$3<>\"\",AQ$3*VLOOKUP(AQ$2,'Technische Daten'!$A:$G,6,0),0)","v":0},{"$f":"IF(AR$3<>\"\",AR$3*VLOOKUP(AR$2,'Technische Daten'!$A:$G,6,0),0)","v":0},{"$f":"IF(AS$3<>\"\",AS$3*VLOOKUP(AS$2,'Technische Daten'!$A:$G,6,0),0)","v":0},{"$f":"IF(AT$3<>\"\",AT$3*VLOOKUP(AT$2,'Technische Daten'!$A:$G,6,0),0)","v":0},{"$f":"IF(AU$3<>\"\",AU$3*VLOOKUP(AU$2,'Technische Daten'!$A:$G,6,0),0)","v":0},{"$f":"IF(AV$3<>\"\",AV$3*VLOOKUP(AV$2,'Technische Daten'!$A:$G,6,0),0)","v":0},{"$f":"IF(AW$3<>\"\",AW$3*VLOOKUP(AW$2,'Technische Daten'!$A:$G,6,0),0)","v":0},{"$f":"IF(AX$3<>\"\",AX$3*VLOOKUP(AX$2,'Technische Daten'!$A:$G,6,0),0)","v":0}]
[{"$f":"Texte!B25","v":"Anzahl verbleibende Tx-PDO (Byte)"},{"$f":"IF(SUM(C31:AX31)>0,ROUNDDOWN(SUM(C31:AX31)/8,0),ROUNDUP(SUM(C31:AX31)/8,0))","v":0},{"$f":"IF(C$3<>\"\",C$3*VLOOKUP(C$2,'Technische Daten'!$A:$G,7,0),0)","v":0},{"$f":"IF(D$3<>\"\",D$3*VLOOKUP(D$2,'Technische Daten'!$A:$G,7,0),0)","v":0},{"$f":"IF(E$3<>\"\",E$3*VLOOKUP(E$2,'Technische Daten'!$A:$G,7,0),0)","v":0},{"$f":"IF(F$3<>\"\",F$3*VLOOKUP(F$2,'Technische Daten'!$A:$G,7,0),0)","v":0},{"$f":"IF(G$3<>\"\",G$3*VLOOKUP(G$2,'Technische Daten'!$A:$G,7,0),0)","v":0},{"$f":"IF(H$3<>\"\",H$3*VLOOKUP(H$2,'Technische Daten'!$A:$G,7,0),0)","v":0},{"$f":"IF(I$3<>\"\",I$3*VLOOKUP(I$2,'Technische Daten'!$A:$G,7,0),0)","v":0},{"$f":"IF(J$3<>\"\",J$3*VLOOKUP(J$2,'Technische Daten'!$A:$G,7,0),0)","v":0},{"$f":"IF(K$3<>\"\",K$3*VLOOKUP(K$2,'Technische Daten'!$A:$G,7,0),0)","v":0},{"$f":"IF(L$3<>\"\",L$3*VLOOKUP(L$2,'Technische Daten'!$A:$G,7,0),0)","v":0},{"$f":"IF(M$3<>\"\",M$3*VLOOKUP(M$2,'Technische Daten'!$A:$G,7,0),0)","v":0},{"$f":"IF(N$3<>\"\",N$3*VLOOKUP(N$2,'Technische Daten'!$A:$G,7,0),0)","v":0},{"$f":"IF(O$3<>\"\",O$3*VLOOKUP(O$2,'Technische Daten'!$A:$G,7,0),0)","v":0},{"$f":"IF(P$3<>\"\",P$3*VLOOKUP(P$2,'Technische Daten'!$A:$G,7,0),0)","v":0},{"$f":"IF(Q$3<>\"\",Q$3*VLOOKUP(Q$2,'Technische Daten'!$A:$G,7,0),0)","v":0},{"$f":"IF(R$3<>\"\",R$3*VLOOKUP(R$2,'Technische Daten'!$A:$G,7,0),0)","v":0},{"$f":"IF(S$3<>\"\",S$3*VLOOKUP(S$2,'Technische Daten'!$A:$G,7,0),0)","v":0},{"$f":"IF(T$3<>\"\",T$3*VLOOKUP(T$2,'Technische Daten'!$A:$G,7,0),0)","v":0},{"$f":"IF(U$3<>\"\",U$3*VLOOKUP(U$2,'Technische Daten'!$A:$G,7,0),0)","v":0},{"$f":"IF(V$3<>\"\",V$3*VLOOKUP(V$2,'Technische Daten'!$A:$G,7,0),0)","v":0},{"$f":"IF(W$3<>\"\",W$3*VLOOKUP(W$2,'Technische Daten'!$A:$G,7,0),0)","v":0},{"$f":"IF(X$3<>\"\",X$3*VLOOKUP(X$2,'Technische Daten'!$A:$G,7,0),0)","v":0},{"$f":"IF(Y$3<>\"\",Y$3*VLOOKUP(Y$2,'Technische Daten'!$A:$G,7,0),0)","v":0},{"$f":"IF(Z$3<>\"\",Z$3*VLOOKUP(Z$2,'Technische Daten'!$A:$G,7,0),0)","v":0},{"$f":"IF(AA$3<>\"\",AA$3*VLOOKUP(AA$2,'Technische Daten'!$A:$G,7,0),0)","v":0},{"$f":"IF(AB$3<>\"\",AB$3*VLOOKUP(AB$2,'Technische Daten'!$A:$G,7,0),0)","v":0},{"$f":"IF(AC$3<>\"\",AC$3*VLOOKUP(AC$2,'Technische Daten'!$A:$G,7,0),0)","v":0},{"$f":"IF(AD$3<>\"\",AD$3*VLOOKUP(AD$2,'Technische Daten'!$A:$G,7,0),0)","v":0},{"$f":"IF(AE$3<>\"\",AE$3*VLOOKUP(AE$2,'Technische Daten'!$A:$G,7,0),0)","v":0},{"$f":"IF(AF$3<>\"\",AF$3*VLOOKUP(AF$2,'Technische Daten'!$A:$G,7,0),0)","v":0},{"$f":"IF(AG$3<>\"\",AG$3*VLOOKUP(AG$2,'Technische Daten'!$A:$G,7,0),0)","v":0},{"$f":"IF(AH$3<>\"\",AH$3*VLOOKUP(AH$2,'Technische Daten'!$A:$G,7,0),0)","v":0},{"$f":"IF(AI$3<>\"\",AI$3*VLOOKUP(AI$2,'Technische Daten'!$A:$G,7,0),0)","v":0},{"$f":"IF(AJ$3<>\"\",AJ$3*VLOOKUP(AJ$2,'Technische Daten'!$A:$G,7,0),0)","v":0},{"$f":"IF(AK$3<>\"\",AK$3*VLOOKUP(AK$2,'Technische Daten'!$A:$G,7,0),0)","v":0},{"$f":"IF(AL$3<>\"\",AL$3*VLOOKUP(AL$2,'Technische Daten'!$A:$G,7,0),0)","v":0},{"$f":"IF(AM$3<>\"\",AM$3*VLOOKUP(AM$2,'Technische Daten'!$A:$G,7,0),0)","v":0},{"$f":"IF(AN$3<>\"\",AN$3*VLOOKUP(AN$2,'Technische Daten'!$A:$G,7,0),0)","v":0},{"$f":"IF(AO$3<>\"\",AO$3*VLOOKUP(AO$2,'Technische Daten'!$A:$G,7,0),0)","v":0},{"$f":"IF(AP$3<>\"\",AP$3*VLOOKUP(AP$2,'Technische Daten'!$A:$G,7,0),0)","v":0},{"$f":"IF(AQ$3<>\"\",AQ$3*VLOOKUP(AQ$2,'Technische Daten'!$A:$G,7,0),0)","v":0},{"$f":"IF(AR$3<>\"\",AR$3*VLOOKUP(AR$2,'Technische Daten'!$A:$G,7,0),0)","v":0},{"$f":"IF(AS$3<>\"\",AS$3*VLOOKUP(AS$2,'Technische Daten'!$A:$G,7,0),0)","v":0},{"$f":"IF(AT$3<>\"\",AT$3*VLOOKUP(AT$2,'Technische Daten'!$A:$G,7,0),0)","v":0},{"$f":"IF(AU$3<>\"\",AU$3*VLOOKUP(AU$2,'Technische Daten'!$A:$G,7,0),0)","v":0},{"$f":"IF(AV$3<>\"\",AV$3*VLOOKUP(AV$2,'Technische Daten'!$A:$G,7,0),0)","v":0},{"$f":"IF(AW$3<>\"\",AW$3*VLOOKUP(AW$2,'Technische Daten'!$A:$G,7,0),0)","v":0},{"$f":"IF(AX$3<>\"\",AX$3*VLOOKUP(AX$2,'Technische Daten'!$A:$G,7,0),0)","v":0}]
[{"$f":"Texte!B26","v":"Anzahl Parameter (Byte)"},{"$f":"SUM(C32:AX32) / 8","v":0},{"$f":"IF(C$3<>\"\",C$3*VLOOKUP(C$2,'Technische Daten'!$A:$H,8,0),0)","v":0},{"$f":"IF(D$3<>\"\",D$3*VLOOKUP(D$2,'Technische Daten'!$A:$H,8,0),0)","v":0},{"$f":"IF(E$3<>\"\",E$3*VLOOKUP(E$2,'Technische Daten'!$A:$H,8,0),0)","v":0},{"$f":"IF(F$3<>\"\",F$3*VLOOKUP(F$2,'Technische Daten'!$A:$H,8,0),0)","v":0},{"$f":"IF(G$3<>\"\",G$3*VLOOKUP(G$2,'Technische Daten'!$A:$H,8,0),0)","v":0},{"$f":"IF(H$3<>\"\",H$3*VLOOKUP(H$2,'Technische Daten'!$A:$H,8,0),0)","v":0},{"$f":"IF(I$3<>\"\",I$3*VLOOKUP(I$2,'Technische Daten'!$A:$H,8,0),0)","v":0},{"$f":"IF(J$3<>\"\",J$3*VLOOKUP(J$2,'Technische Daten'!$A:$H,8,0),0)","v":0},{"$f":"IF(K$3<>\"\",K$3*VLOOKUP(K$2,'Technische Daten'!$A:$H,8,0),0)","v":0},{"$f":"IF(L$3<>\"\",L$3*VLOOKUP(L$2,'Technische Daten'!$A:$H,8,0),0)","v":0},{"$f":"IF(M$3<>\"\",M$3*VLOOKUP(M$2,'Technische Daten'!$A:$H,8,0),0)","v":0},{"$f":"IF(N$3<>\"\",N$3*VLOOKUP(N$2,'Technische Daten'!$A:$H,8,0),0)","v":0},{"$f":"IF(O$3<>\"\",O$3*VLOOKUP(O$2,'Technische Daten'!$A:$H,8,0),0)","v":0},{"$f":"IF(P$3<>\"\",P$3*VLOOKUP(P$2,'Technische Daten'!$A:$H,8,0),0)","v":0},{"$f":"IF(Q$3<>\"\",Q$3*VLOOKUP(Q$2,'Technische Daten'!$A:$H,8,0),0)","v":0},{"$f":"IF(R$3<>\"\",R$3*VLOOKUP(R$2,'Technische Daten'!$A:$H,8,0),0)","v":0},{"$f":"IF(S$3<>\"\",S$3*VLOOKUP(S$2,'Technische Daten'!$A:$H,8,0),0)","v":0},{"$f":"IF(T$3<>\"\",T$3*VLOOKUP(T$2,'Technische Daten'!$A:$H,8,0),0)","v":0},{"$f":"IF(U$3<>\"\",U$3*VLOOKUP(U$2,'Technische Daten'!$A:$H,8,0),0)","v":0},{"$f":"IF(V$3<>\"\",V$3*VLOOKUP(V$2,'Technische Daten'!$A:$H,8,0),0)","v":0},{"$f":"IF(W$3<>\"\",W$3*VLOOKUP(W$2,'Technische Daten'!$A:$H,8,0),0)","v":0},{"$f":"IF(X$3<>\"\",X$3*VLOOKUP(X$2,'Technische Daten'!$A:$H,8,0),0)","v":0},{"$f":"IF(Y$3<>\"\",Y$3*VLOOKUP(Y$2,'Technische Daten'!$A:$H,8,0),0)","v":0},{"$f":"IF(Z$3<>\"\",Z$3*VLOOKUP(Z$2,'Technische Daten'!$A:$H,8,0),0)","v":0},{"$f":"IF(AA$3<>\"\",AA$3*VLOOKUP(AA$2,'Technische Daten'!$A:$H,8,0),0)","v":0},{"$f":"IF(AB$3<>\"\",AB$3*VLOOKUP(AB$2,'Technische Daten'!$A:$H,8,0),0)","v":0},{"$f":"IF(AC$3<>\"\",AC$3*VLOOKUP(AC$2,'Technische Daten'!$A:$H,8,0),0)","v":0},{"$f":"IF(AD$3<>\"\",AD$3*VLOOKUP(AD$2,'Technische Daten'!$A:$H,8,0),0)","v":0},{"$f":"IF(AE$3<>\"\",AE$3*VLOOKUP(AE$2,'Technische Daten'!$A:$H,8,0),0)","v":0},{"$f":"IF(AF$3<>\"\",AF$3*VLOOKUP(AF$2,'Technische Daten'!$A:$H,8,0),0)","v":0},{"$f":"IF(AG$3<>\"\",AG$3*VLOOKUP(AG$2,'Technische Daten'!$A:$H,8,0),0)","v":0},{"$f":"IF(AH$3<>\"\",AH$3*VLOOKUP(AH$2,'Technische Daten'!$A:$H,8,0),0)","v":0},{"$f":"IF(AI$3<>\"\",AI$3*VLOOKUP(AI$2,'Technische Daten'!$A:$H,8,0),0)","v":0},{"$f":"IF(AJ$3<>\"\",AJ$3*VLOOKUP(AJ$2,'Technische Daten'!$A:$H,8,0),0)","v":0},{"$f":"IF(AK$3<>\"\",AK$3*VLOOKUP(AK$2,'Technische Daten'!$A:$H,8,0),0)","v":0},{"$f":"IF(AL$3<>\"\",AL$3*VLOOKUP(AL$2,'Technische Daten'!$A:$H,8,0),0)","v":0},{"$f":"IF(AM$3<>\"\",AM$3*VLOOKUP(AM$2,'Technische Daten'!$A:$H,8,0),0)","v":0},{"$f":"IF(AN$3<>\"\",AN$3*VLOOKUP(AN$2,'Technische Daten'!$A:$H,8,0),0)","v":0},{"$f":"IF(AO$3<>\"\",AO$3*VLOOKUP(AO$2,'Technische Daten'!$A:$H,8,0),0)","v":0},{"$f":"IF(AP$3<>\"\",AP$3*VLOOKUP(AP$2,'Technische Daten'!$A:$H,8,0),0)","v":0},{"$f":"IF(AQ$3<>\"\",AQ$3*VLOOKUP(AQ$2,'Technische Daten'!$A:$H,8,0),0)","v":0},{"$f":"IF(AR$3<>\"\",AR$3*VLOOKUP(AR$2,'Technische Daten'!$A:$H,8,0),0)","v":0},{"$f":"IF(AS$3<>\"\",AS$3*VLOOKUP(AS$2,'Technische Daten'!$A:$H,8,0),0)","v":0},{"$f":"IF(AT$3<>\"\",AT$3*VLOOKUP(AT$2,'Technische Daten'!$A:$H,8,0),0)","v":0},{"$f":"IF(AU$3<>\"\",AU$3*VLOOKUP(AU$2,'Technische Daten'!$A:$H,8,0),0)","v":0},{"$f":"IF(AV$3<>\"\",AV$3*VLOOKUP(AV$2,'Technische Daten'!$A:$H,8,0),0)","v":0},{"$f":"IF(AW$3<>\"\",AW$3*VLOOKUP(AW$2,'Technische Daten'!$A:$H,8,0),0)","v":0},{"$f":"IF(AX$3<>\"\",AX$3*VLOOKUP(AX$2,'Technische Daten'!$A:$H,8,0),0)","v":0}]
[{"$f":"Texte!B27","v":"Konfigurationscheck"},{"$f":"IF(AND(B30>=0, B31>=0, B32 >= 0),\"OK\",\"NOK\")","v":"OK"}]
[]
[{"$f":"Texte!B28","v":"Kommunikation (EtherCAT)"}]
[{"$f":"Texte!B29","v":"Anzahl verbleibende Rx-PDO (Byte)"},{"$f":"IF(SUM(C36:AX36)>0,ROUNDDOWN(SUM(C36:AX36)/8,0),ROUNDUP(SUM(C36:AX36)/8,0))","v":0},{"$f":"IF(C$3<>\"\",C$3*VLOOKUP(C$2,'Technische Daten'!$A:$G,6,0),0)","v":0},{"$f":"IF(D$3<>\"\",D$3*VLOOKUP(D$2,'Technische Daten'!$A:$G,6,0),0)","v":0},{"$f":"IF(E$3<>\"\",E$3*VLOOKUP(E$2,'Technische Daten'!$A:$G,6,0),0)","v":0},{"$f":"IF(F$3<>\"\",F$3*VLOOKUP(F$2,'Technische Daten'!$A:$G,6,0),0)","v":0},{"$f":"IF(G$3<>\"\",G$3*VLOOKUP(G$2,'Technische Daten'!$A:$G,6,0),0)","v":0},{"$f":"IF(H$3<>\"\",H$3*VLOOKUP(H$2,'Technische Daten'!$A:$G,6,0),0)","v":0},{"$f":"IF(I$3<>\"\",I$3*VLOOKUP(I$2,'Technische Daten'!$A:$G,6,0),0)","v":0},{"$f":"IF(J$3<>\"\",J$3*VLOOKUP(J$2,'Technische Daten'!$A:$G,6,0),0)","v":0},{"$f":"IF(K$3<>\"\",K$3*VLOOKUP(K$2,'Technische Daten'!$A:$G,6,0),0)","v":0},{"$f":"IF(L$3<>\"\",L$3*VLOOKUP(L$2,'Technische Daten'!$A:$G,6,0),0)","v":0},{"$f":"IF(M$3<>\"\",M$3*VLOOKUP(M$2,'Technische Daten'!$A:$G,6,0),0)","v":0},{"$f":"IF(N$3<>\"\",N$3*VLOOKUP(N$2,'Technische Daten'!$A:$G,6,0),0)","v":0},{"$f":"IF(O$3<>\"\",O$3*VLOOKUP(O$2,'Technische Daten'!$A:$G,6,0),0)","v":0},{"$f":"IF(P$3<>\"\",P$3*VLOOKUP(P$2,'Technische Daten'!$A:$G,6,0),0)","v":0},{"$f":"IF(Q$3<>\"\",Q$3*VLOOKUP(Q$2,'Technische Daten'!$A:$G,6,0),0)","v":0},{"$f":"IF(R$3<>\"\",R$3*VLOOKUP(R$2,'Technische Daten'!$A:$G,6,0),0)","v":0},{"$f":"IF(S$3<>\"\",S$3*VLOOKUP(S$2,'Technische Daten'!$A:$G,6,0),0)","v":0},{"$f":"IF(T$3<>\"\",T$3*VLOOKUP(T$2,'Technische Daten'!$A:$G,6,0),0)","v":0},{"$f":"IF(U$3<>\"\",U$3*VLOOKUP(U$2,'Technische Daten'!$A:$G,6,0),0)","v":0},{"$f":"IF(V$3<>\"\",V$3*VLOOKUP(V$2,'Technische Daten'!$A:$G,6,0),0)","v":0},{"$f":"IF(W$3<>\"\",W$3*VLOOKUP(W$2,'Technische Daten'!$A:$G,6,0),0)","v":0},{"$f":"IF(X$3<>\"\",X$3*VLOOKUP(X$2,'Technische Daten'!$A:$G,6,0),0)","v":0},{"$f":"IF(Y$3<>\"\",Y$3*VLOOKUP(Y$2,'Technische Daten'!$A:$G,6,0),0)","v":0},{"$f":"IF(Z$3<>\"\",Z$3*VLOOKUP(Z$2,'Technische Daten'!$A:$G,6,0),0)","v":0},{"$f":"IF(AA$3<>\"\",AA$3*VLOOKUP(AA$2,'Technische Daten'!$A:$G,6,0),0)","v":0},{"$f":"IF(AB$3<>\"\",AB$3*VLOOKUP(AB$2,'Technische Daten'!$A:$G,6,0),0)","v":0},{"$f":"IF(AC$3<>\"\",AC$3*VLOOKUP(AC$2,'Technische Daten'!$A:$G,6,0),0)","v":0},{"$f":"IF(AD$3<>\"\",AD$3*VLOOKUP(AD$2,'Technische Daten'!$A:$G,6,0),0)","v":0},{"$f":"IF(AE$3<>\"\",AE$3*VLOOKUP(AE$2,'Technische Daten'!$A:$G,6,0),0)","v":0},{"$f":"IF(AF$3<>\"\",AF$3*VLOOKUP(AF$2,'Technische Daten'!$A:$G,6,0),0)","v":0},{"$f":"IF(AG$3<>\"\",AG$3*VLOOKUP(AG$2,'Technische Daten'!$A:$G,6,0),0)","v":0},{"$f":"IF(AH$3<>\"\",AH$3*VLOOKUP(AH$2,'Technische Daten'!$A:$G,6,0),0)","v":0},{"$f":"IF(AI$3<>\"\",AI$3*VLOOKUP(AI$2,'Technische Daten'!$A:$G,6,0),0)","v":0},{"$f":"IF(AJ$3<>\"\",AJ$3*VLOOKUP(AJ$2,'Technische Daten'!$A:$G,6,0),0)","v":0},{"$f":"IF(AK$3<>\"\",AK$3*VLOOKUP(AK$2,'Technische Daten'!$A:$G,6,0),0)","v":0},{"$f":"IF(AL$3<>\"\",AL$3*VLOOKUP(AL$2,'Technische Daten'!$A:$G,6,0),0)","v":0},{"$f":"IF(AM$3<>\"\",AM$3*VLOOKUP(AM$2,'Technische Daten'!$A:$G,6,0),0)","v":0},{"$f":"IF(AN$3<>\"\",AN$3*VLOOKUP(AN$2,'Technische Daten'!$A:$G,6,0),0)","v":0},{"$f":"IF(AO$3<>\"\",AO$3*VLOOKUP(AO$2,'Technische Daten'!$A:$G,6,0),0)","v":0},{"$f":"IF(AP$3<>\"\",AP$3*VLOOKUP(AP$2,'Technische Daten'!$A:$G,6,0),0)","v":0},{"$f":"IF(AQ$3<>\"\",AQ$3*VLOOKUP(AQ$2,'Technische Daten'!$A:$G,6,0),0)","v":0},{"$f":"IF(AR$3<>\"\",AR$3*VLOOKUP(AR$2,'Technische Daten'!$A:$G,6,0),0)","v":0},{"$f":"IF(AS$3<>\"\",AS$3*VLOOKUP(AS$2,'Technische Daten'!$A:$G,6,0),0)","v":0},{"$f":"IF(AT$3<>\"\",AT$3*VLOOKUP(AT$2,'Technische Daten'!$A:$G,6,0),0)","v":0},{"$f":"IF(AU$3<>\"\",AU$3*VLOOKUP(AU$2,'Technische Daten'!$A:$G,6,0),0)","v":0},{"$f":"IF(AV$3<>\"\",AV$3*VLOOKUP(AV$2,'Technische Daten'!$A:$G,6,0),0)","v":0},{"$f":"IF(AW$3<>\"\",AW$3*VLOOKUP(AW$2,'Technische Daten'!$A:$G,6,0),0)","v":0},{"$f":"IF(AX$3<>\"\",AX$3*VLOOKUP(AX$2,'Technische Daten'!$A:$G,6,0),0)","v":0}]
[{"$f":"Texte!B30","v":"Anzahl verbleibende Tx-PDO (Byte)"},{"$f":"IF(SUM(C37:AX37)>0,ROUNDDOWN(SUM(C37:AX37)/8,0),ROUNDUP(SUM(C37:AX37)/8,0))","v":0},{"$f":"IF(C$3<>\"\",C$3*VLOOKUP(C$2,'Technische Daten'!$A:$G,7,0),0)","v":0},{"$f":"IF(D$3<>\"\",D$3*VLOOKUP(D$2,'Technische Daten'!$A:$G,7,0),0)","v":0},{"$f":"IF(E$3<>\"\",E$3*VLOOKUP(E$2,'Technische Daten'!$A:$G,7,0),0)","v":0},{"$f":"IF(F$3<>\"\",F$3*VLOOKUP(F$2,'Technische Daten'!$A:$G,7,0),0)","v":0},{"$f":"IF(G$3<>\"\",G$3*VLOOKUP(G$2,'Technische Daten'!$A:$G,7,0),0)","v":0},{"$f":"IF(H$3<>\"\",H$3*VLOOKUP(H$2,'Technische Daten'!$A:$G,7,0),0)","v":0},{"$f":"IF(I$3<>\"\",I$3*VLOOKUP(I$2,'Technische Daten'!$A:$G,7,0),0)","v":0},{"$f":"IF(J$3<>\"\",J$3*VLOOKUP(J$2,'Technische Daten'!$A:$G,7,0),0)","v":0},{"$f":"IF(K$3<>\"\",K$3*VLOOKUP(K$2,'Technische Daten'!$A:$G,7,0),0)","v":0},{"$f":"IF(L$3<>\"\",L$3*VLOOKUP(L$2,'Technische Daten'!$A:$G,7,0),0)","v":0},{"$f":"IF(M$3<>\"\",M$3*VLOOKUP(M$2,'Technische Daten'!$A:$G,7,0),0)","v":0},{"$f":"IF(N$3<>\"\",N$3*VLOOKUP(N$2,'Technische Daten'!$A:$G,7,0),0)","v":0},{"$f":"IF(O$3<>\"\",O$3*VLOOKUP(O$2,'Technische Daten'!$A:$G,7,0),0)","v":0},{"$f":"IF(P$3<>\"\",P$3*VLOOKUP(P$2,'Technische Daten'!$A:$G,7,0),0)","v":0},{"$f":"IF(Q$3<>\"\",Q$3*VLOOKUP(Q$2,'Technische Daten'!$A:$G,7,0),0)","v":0},{"$f":"IF(R$3<>\"\",R$3*VLOOKUP(R$2,'Technische Daten'!$A:$G,7,0),0)","v":0},{"$f":"IF(S$3<>\"\",S$3*VLOOKUP(S$2,'Technische Daten'!$A:$G,7,0),0)","v":0},{"$f":"IF(T$3<>\"\",T$3*VLOOKUP(T$2,'Technische Daten'!$A:$G,7,0),0)","v":0},{"$f":"IF(U$3<>\"\",U$3*VLOOKUP(U$2,'Technische Daten'!$A:$G,7,0),0)","v":0},{"$f":"IF(V$3<>\"\",V$3*VLOOKUP(V$2,'Technische Daten'!$A:$G,7,0),0)","v":0},{"$f":"IF(W$3<>\"\",W$3*VLOOKUP(W$2,'Technische Daten'!$A:$G,7,0),0)","v":0},{"$f":"IF(X$3<>\"\",X$3*VLOOKUP(X$2,'Technische Daten'!$A:$G,7,0),0)","v":0},{"$f":"IF(Y$3<>\"\",Y$3*VLOOKUP(Y$2,'Technische Daten'!$A:$G,7,0),0)","v":0},{"$f":"IF(Z$3<>\"\",Z$3*VLOOKUP(Z$2,'Technische Daten'!$A:$G,7,0),0)","v":0},{"$f":"IF(AA$3<>\"\",AA$3*VLOOKUP(AA$2,'Technische Daten'!$A:$G,7,0),0)","v":0},{"$f":"IF(AB$3<>\"\",AB$3*VLOOKUP(AB$2,'Technische Daten'!$A:$G,7,0),0)","v":0},{"$f":"IF(AC$3<>\"\",AC$3*VLOOKUP(AC$2,'Technische Daten'!$A:$G,7,0),0)","v":0},{"$f":"IF(AD$3<>\"\",AD$3*VLOOKUP(AD$2,'Technische Daten'!$A:$G,7,0),0)","v":0},{"$f":"IF(AE$3<>\"\",AE$3*VLOOKUP(AE$2,'Technische Daten'!$A:$G,7,0),0)","v":0},{"$f":"IF(AF$3<>\"\",AF$3*VLOOKUP(AF$2,'Technische Daten'!$A:$G,7,0),0)","v":0},{"$f":"IF(AG$3<>\"\",AG$3*VLOOKUP(AG$2,'Technische Daten'!$A:$G,7,0),0)","v":0},{"$f":"IF(AH$3<>\"\",AH$3*VLOOKUP(AH$2,'Technische Daten'!$A:$G,7,0),0)","v":0},{"$f":"IF(AI$3<>\"\",AI$3*VLOOKUP(AI$2,'Technische Daten'!$A:$G,7,0),0)","v":0},{"$f":"IF(AJ$3<>\"\",AJ$3*VLOOKUP(AJ$2,'Technische Daten'!$A:$G,7,0),0)","v":0},{"$f":"IF(AK$3<>\"\",AK$3*VLOOKUP(AK$2,'Technische Daten'!$A:$G,7,0),0)","v":0},{"$f":"IF(AL$3<>\"\",AL$3*VLOOKUP(AL$2,'Technische Daten'!$A:$G,7,0),0)","v":0},{"$f":"IF(AM$3<>\"\",AM$3*VLOOKUP(AM$2,'Technische Daten'!$A:$G,7,0),0)","v":0},{"$f":"IF(AN$3<>\"\",AN$3*VLOOKUP(AN$2,'Technische Daten'!$A:$G,7,0),0)","v":0},{"$f":"IF(AO$3<>\"\",AO$3*VLOOKUP(AO$2,'Technische Daten'!$A:$G,7,0),0)","v":0},{"$f":"IF(AP$3<>\"\",AP$3*VLOOKUP(AP$2,'Technische Daten'!$A:$G,7,0),0)","v":0},{"$f":"IF(AQ$3<>\"\",AQ$3*VLOOKUP(AQ$2,'Technische Daten'!$A:$G,7,0),0)","v":0},{"$f":"IF(AR$3<>\"\",AR$3*VLOOKUP(AR$2,'Technische Daten'!$A:$G,7,0),0)","v":0},{"$f":"IF(AS$3<>\"\",AS$3*VLOOKUP(AS$2,'Technische Daten'!$A:$G,7,0),0)","v":0},{"$f":"IF(AT$3<>\"\",AT$3*VLOOKUP(AT$2,'Technische Daten'!$A:$G,7,0),0)","v":0},{"$f":"IF(AU$3<>\"\",AU$3*VLOOKUP(AU$2,'Technische Daten'!$A:$G,7,0),0)","v":0},{"$f":"IF(AV$3<>\"\",AV$3*VLOOKUP(AV$2,'Technische Daten'!$A:$G,7,0),0)","v":0},{"$f":"IF(AW$3<>\"\",AW$3*VLOOKUP(AW$2,'Technische Daten'!$A:$G,7,0),0)","v":0},{"$f":"IF(AX$3<>\"\",AX$3*VLOOKUP(AX$2,'Technische Daten'!$A:$G,7,0),0)","v":0}]
[{"$f":"Texte!B32","v":"Konfigurationscheck"},{"$f":"IF(AND(B36>=0, B37>=0),\"OK\",\"NOK\")","v":"OK"}]
[]
[{"$f":"Texte!B23","v":"Kommunikation (PROFINET)"}]
[{"$f":"Texte!B24","v":"Anzahl verbleibende Rx-PDO (Byte)"},{"$f":"IF(SUM(C41:AX41)>0,ROUNDDOWN(SUM(C41:AX41)/8,0),ROUNDUP(SUM(C41:AX41)/8,0))","v":0},{"$f":"IF(C$3<>\"\",C$3*VLOOKUP(C$2,'Technische Daten'!$A:$G,6,0),0)","v":0},{"$f":"IF(D$3<>\"\",D$3*VLOOKUP(D$2,'Technische Daten'!$A:$G,6,0),0)","v":0},{"$f":"IF(E$3<>\"\",E$3*VLOOKUP(E$2,'Technische Daten'!$A:$G,6,0),0)","v":0},{"$f":"IF(F$3<>\"\",F$3*VLOOKUP(F$2,'Technische Daten'!$A:$G,6,0),0)","v":0},{"$f":"IF(G$3<>\"\",G$3*VLOOKUP(G$2,'Technische Daten'!$A:$G,6,0),0)","v":0},{"$f":"IF(H$3<>\"\",H$3*VLOOKUP(H$2,'Technische Daten'!$A:$G,6,0),0)","v":0},{"$f":"IF(I$3<>\"\",I$3*VLOOKUP(I$2,'Technische Daten'!$A:$G,6,0),0)","v":0},{"$f":"IF(J$3<>\"\",J$3*VLOOKUP(J$2,'Technische Daten'!$A:$G,6,0),0)","v":0},{"$f":"IF(K$3<>\"\",K$3*VLOOKUP(K$2,'Technische Daten'!$A:$G,6,0),0)","v":0},{"$f":"IF(L$3<>\"\",L$3*VLOOKUP(L$2,'Technische Daten'!$A:$G,6,0),0)","v":0},{"$f":"IF(M$3<>\"\",M$3*VLOOKUP(M$2,'Technische Daten'!$A:$G,6,0),0)","v":0},{"$f":"IF(N$3<>\"\",N$3*VLOOKUP(N$2,'Technische Daten'!$A:$G,6,0),0)","v":0},{"$f":"IF(O$3<>\"\",O$3*VLOOKUP(O$2,'Technische Daten'!$A:$G,6,0),0)","v":0},{"$f":"IF(P$3<>\"\",P$3*VLOOKUP(P$2,'Technische Daten'!$A:$G,6,0),0)","v":0},{"$f":"IF(Q$3<>\"\",Q$3*VLOOKUP(Q$2,'Technische Daten'!$A:$G,6,0),0)","v":0},{"$f":"IF(R$3<>\"\",R$3*VLOOKUP(R$2,'Technische Daten'!$A:$G,6,0),0)","v":0},{"$f":"IF(S$3<>\"\",S$3*VLOOKUP(S$2,'Technische Daten'!$A:$G,6,0),0)","v":0},{"$f":"IF(T$3<>\"\",T$3*VLOOKUP(T$2,'Technische Daten'!$A:$G,6,0),0)","v":0},{"$f":"IF(U$3<>\"\",U$3*VLOOKUP(U$2,'Technische Daten'!$A:$G,6,0),0)","v":0},{"$f":"IF(V$3<>\"\",V$3*VLOOKUP(V$2,'Technische Daten'!$A:$G,6,0),0)","v":0},{"$f":"IF(W$3<>\"\",W$3*VLOOKUP(W$2,'Technische Daten'!$A:$G,6,0),0)","v":0},{"$f":"IF(X$3<>\"\",X$3*VLOOKUP(X$2,'Technische Daten'!$A:$G,6,0),0)","v":0},{"$f":"IF(Y$3<>\"\",Y$3*VLOOKUP(Y$2,'Technische Daten'!$A:$G,6,0),0)","v":0},{"$f":"IF(Z$3<>\"\",Z$3*VLOOKUP(Z$2,'Technische Daten'!$A:$G,6,0),0)","v":0},{"$f":"IF(AA$3<>\"\",AA$3*VLOOKUP(AA$2,'Technische Daten'!$A:$G,6,0),0)","v":0},{"$f":"IF(AB$3<>\"\",AB$3*VLOOKUP(AB$2,'Technische Daten'!$A:$G,6,0),0)","v":0},{"$f":"IF(AC$3<>\"\",AC$3*VLOOKUP(AC$2,'Technische Daten'!$A:$G,6,0),0)","v":0},{"$f":"IF(AD$3<>\"\",AD$3*VLOOKUP(AD$2,'Technische Daten'!$A:$G,6,0),0)","v":0},{"$f":"IF(AE$3<>\"\",AE$3*VLOOKUP(AE$2,'Technische Daten'!$A:$G,6,0),0)","v":0},{"$f":"IF(AF$3<>\"\",AF$3*VLOOKUP(AF$2,'Technische Daten'!$A:$G,6,0),0)","v":0},{"$f":"IF(AG$3<>\"\",AG$3*VLOOKUP(AG$2,'Technische Daten'!$A:$G,6,0),0)","v":0},{"$f":"IF(AH$3<>\"\",AH$3*VLOOKUP(AH$2,'Technische Daten'!$A:$G,6,0),0)","v":0},{"$f":"IF(AI$3<>\"\",AI$3*VLOOKUP(AI$2,'Technische Daten'!$A:$G,6,0),0)","v":0},{"$f":"IF(AJ$3<>\"\",AJ$3*VLOOKUP(AJ$2,'Technische Daten'!$A:$G,6,0),0)","v":0},{"$f":"IF(AK$3<>\"\",AK$3*VLOOKUP(AK$2,'Technische Daten'!$A:$G,6,0),0)","v":0},{"$f":"IF(AL$3<>\"\",AL$3*VLOOKUP(AL$2,'Technische Daten'!$A:$G,6,0),0)","v":0},{"$f":"IF(AM$3<>\"\",AM$3*VLOOKUP(AM$2,'Technische Daten'!$A:$G,6,0),0)","v":0},{"$f":"IF(AN$3<>\"\",AN$3*VLOOKUP(AN$2,'Technische Daten'!$A:$G,6,0),0)","v":0},{"$f":"IF(AO$3<>\"\",AO$3*VLOOKUP(AO$2,'Technische Daten'!$A:$G,6,0),0)","v":0},{"$f":"IF(AP$3<>\"\",AP$3*VLOOKUP(AP$2,'Technische Daten'!$A:$G,6,0),0)","v":0},{"$f":"IF(AQ$3<>\"\",AQ$3*VLOOKUP(AQ$2,'Technische Daten'!$A:$G,6,0),0)","v":0},{"$f":"IF(AR$3<>\"\",AR$3*VLOOKUP(AR$2,'Technische Daten'!$A:$G,6,0),0)","v":0},{"$f":"IF(AS$3<>\"\",AS$3*VLOOKUP(AS$2,'Technische Daten'!$A:$G,6,0),0)","v":0},{"$f":"IF(AT$3<>\"\",AT$3*VLOOKUP(AT$2,'Technische Daten'!$A:$G,6,0),0)","v":0},{"$f":"IF(AU$3<>\"\",AU$3*VLOOKUP(AU$2,'Technische Daten'!$A:$G,6,0),0)","v":0},{"$f":"IF(AV$3<>\"\",AV$3*VLOOKUP(AV$2,'Technische Daten'!$A:$G,6,0),0)","v":0},{"$f":"IF(AW$3<>\"\",AW$3*VLOOKUP(AW$2,'Technische Daten'!$A:$G,6,0),0)","v":0},{"$f":"IF(AX$3<>\"\",AX$3*VLOOKUP(AX$2,'Technische Daten'!$A:$G,6,0),0)","v":0}]
[{"$f":"Texte!B25","v":"Anzahl verbleibende Tx-PDO (Byte)"},{"$f":"IF(SUM(C42:AX42)>0,ROUNDDOWN(SUM(C42:AX42)/8,0),ROUNDUP(SUM(C42:AX42)/8,0))","v":0},{"$f":"IF(C$3<>\"\",C$3*VLOOKUP(C$2,'Technische Daten'!$A:$G,7,0),0)","v":0},{"$f":"IF(D$3<>\"\",D$3*VLOOKUP(D$2,'Technische Daten'!$A:$G,7,0),0)","v":0},{"$f":"IF(E$3<>\"\",E$3*VLOOKUP(E$2,'Technische Daten'!$A:$G,7,0),0)","v":0},{"$f":"IF(F$3<>\"\",F$3*VLOOKUP(F$2,'Technische Daten'!$A:$G,7,0),0)","v":0},{"$f":"IF(G$3<>\"\",G$3*VLOOKUP(G$2,'Technische Daten'!$A:$G,7,0),0)","v":0},{"$f":"IF(H$3<>\"\",H$3*VLOOKUP(H$2,'Technische Daten'!$A:$G,7,0),0)","v":0},{"$f":"IF(I$3<>\"\",I$3*VLOOKUP(I$2,'Technische Daten'!$A:$G,7,0),0)","v":0},{"$f":"IF(J$3<>\"\",J$3*VLOOKUP(J$2,'Technische Daten'!$A:$G,7,0),0)","v":0},{"$f":"IF(K$3<>\"\",K$3*VLOOKUP(K$2,'Technische Daten'!$A:$G,7,0),0)","v":0},{"$f":"IF(L$3<>\"\",L$3*VLOOKUP(L$2,'Technische Daten'!$A:$G,7,0),0)","v":0},{"$f":"IF(M$3<>\"\",M$3*VLOOKUP(M$2,'Technische Daten'!$A:$G,7,0),0)","v":0},{"$f":"IF(N$3<>\"\",N$3*VLOOKUP(N$2,'Technische Daten'!$A:$G,7,0),0)","v":0},{"$f":"IF(O$3<>\"\",O$3*VLOOKUP(O$2,'Technische Daten'!$A:$G,7,0),0)","v":0},{"$f":"IF(P$3<>\"\",P$3*VLOOKUP(P$2,'Technische Daten'!$A:$G,7,0),0)","v":0},{"$f":"IF(Q$3<>\"\",Q$3*VLOOKUP(Q$2,'Technische Daten'!$A:$G,7,0),0)","v":0},{"$f":"IF(R$3<>\"\",R$3*VLOOKUP(R$2,'Technische Daten'!$A:$G,7,0),0)","v":0},{"$f":"IF(S$3<>\"\",S$3*VLOOKUP(S$2,'Technische Daten'!$A:$G,7,0),0)","v":0},{"$f":"IF(T$3<>\"\",T$3*VLOOKUP(T$2,'Technische Daten'!$A:$G,7,0),0)","v":0},{"$f":"IF(U$3<>\"\",U$3*VLOOKUP(U$2,'Technische Daten'!$A:$G,7,0),0)","v":0},{"$f":"IF(V$3<>\"\",V$3*VLOOKUP(V$2,'Technische Daten'!$A:$G,7,0),0)","v":0},{"$f":"IF(W$3<>\"\",W$3*VLOOKUP(W$2,'Technische Daten'!$A:$G,7,0),0)","v":0},{"$f":"IF(X$3<>\"\",X$3*VLOOKUP(X$2,'Technische Daten'!$A:$G,7,0),0)","v":0},{"$f":"IF(Y$3<>\"\",Y$3*VLOOKUP(Y$2,'Technische Daten'!$A:$G,7,0),0)","v":0},{"$f":"IF(Z$3<>\"\",Z$3*VLOOKUP(Z$2,'Technische Daten'!$A:$G,7,0),0)","v":0},{"$f":"IF(AA$3<>\"\",AA$3*VLOOKUP(AA$2,'Technische Daten'!$A:$G,7,0),0)","v":0},{"$f":"IF(AB$3<>\"\",AB$3*VLOOKUP(AB$2,'Technische Daten'!$A:$G,7,0),0)","v":0},{"$f":"IF(AC$3<>\"\",AC$3*VLOOKUP(AC$2,'Technische Daten'!$A:$G,7,0),0)","v":0},{"$f":"IF(AD$3<>\"\",AD$3*VLOOKUP(AD$2,'Technische Daten'!$A:$G,7,0),0)","v":0},{"$f":"IF(AE$3<>\"\",AE$3*VLOOKUP(AE$2,'Technische Daten'!$A:$G,7,0),0)","v":0},{"$f":"IF(AF$3<>\"\",AF$3*VLOOKUP(AF$2,'Technische Daten'!$A:$G,7,0),0)","v":0},{"$f":"IF(AG$3<>\"\",AG$3*VLOOKUP(AG$2,'Technische Daten'!$A:$G,7,0),0)","v":0},{"$f":"IF(AH$3<>\"\",AH$3*VLOOKUP(AH$2,'Technische Daten'!$A:$G,7,0),0)","v":0},{"$f":"IF(AI$3<>\"\",AI$3*VLOOKUP(AI$2,'Technische Daten'!$A:$G,7,0),0)","v":0},{"$f":"IF(AJ$3<>\"\",AJ$3*VLOOKUP(AJ$2,'Technische Daten'!$A:$G,7,0),0)","v":0},{"$f":"IF(AK$3<>\"\",AK$3*VLOOKUP(AK$2,'Technische Daten'!$A:$G,7,0),0)","v":0},{"$f":"IF(AL$3<>\"\",AL$3*VLOOKUP(AL$2,'Technische Daten'!$A:$G,7,0),0)","v":0},{"$f":"IF(AM$3<>\"\",AM$3*VLOOKUP(AM$2,'Technische Daten'!$A:$G,7,0),0)","v":0},{"$f":"IF(AN$3<>\"\",AN$3*VLOOKUP(AN$2,'Technische Daten'!$A:$G,7,0),0)","v":0},{"$f":"IF(AO$3<>\"\",AO$3*VLOOKUP(AO$2,'Technische Daten'!$A:$G,7,0),0)","v":0},{"$f":"IF(AP$3<>\"\",AP$3*VLOOKUP(AP$2,'Technische Daten'!$A:$G,7,0),0)","v":0},{"$f":"IF(AQ$3<>\"\",AQ$3*VLOOKUP(AQ$2,'Technische Daten'!$A:$G,7,0),0)","v":0},{"$f":"IF(AR$3<>\"\",AR$3*VLOOKUP(AR$2,'Technische Daten'!$A:$G,7,0),0)","v":0},{"$f":"IF(AS$3<>\"\",AS$3*VLOOKUP(AS$2,'Technische Daten'!$A:$G,7,0),0)","v":0},{"$f":"IF(AT$3<>\"\",AT$3*VLOOKUP(AT$2,'Technische Daten'!$A:$G,7,0),0)","v":0},{"$f":"IF(AU$3<>\"\",AU$3*VLOOKUP(AU$2,'Technische Daten'!$A:$G,7,0),0)","v":0},{"$f":"IF(AV$3<>\"\",AV$3*VLOOKUP(AV$2,'Technische Daten'!$A:$G,7,0),0)","v":0},{"$f":"IF(AW$3<>\"\",AW$3*VLOOKUP(AW$2,'Technische Daten'!$A:$G,7,0),0)","v":0},{"$f":"IF(AX$3<>\"\",AX$3*VLOOKUP(AX$2,'Technische Daten'!$A:$G,7,0),0)","v":0}]
[{"$f":"Texte!B26","v":"Anzahl Parameter (Byte)"},{"$f":"SUM(C43:AX43) / 8","v":0},{"$f":"IF(C$3<>\"\",C$3*VLOOKUP(C$2,'Technische Daten'!$A:$H,8,0),0)","v":0},{"$f":"IF(D$3<>\"\",D$3*VLOOKUP(D$2,'Technische Daten'!$A:$H,8,0),0)","v":0},{"$f":"IF(E$3<>\"\",E$3*VLOOKUP(E$2,'Technische Daten'!$A:$H,8,0),0)","v":0},{"$f":"IF(F$3<>\"\",F$3*VLOOKUP(F$2,'Technische Daten'!$A:$H,8,0),0)","v":0},{"$f":"IF(G$3<>\"\",G$3*VLOOKUP(G$2,'Technische Daten'!$A:$H,8,0),0)","v":0},{"$f":"IF(H$3<>\"\",H$3*VLOOKUP(H$2,'Technische Daten'!$A:$H,8,0),0)","v":0},{"$f":"IF(I$3<>\"\",I$3*VLOOKUP(I$2,'Technische Daten'!$A:$H,8,0),0)","v":0},{"$f":"IF(J$3<>\"\",J$3*VLOOKUP(J$2,'Technische Daten'!$A:$H,8,0),0)","v":0},{"$f":"IF(K$3<>\"\",K$3*VLOOKUP(K$2,'Technische Daten'!$A:$H,8,0),0)","v":0},{"$f":"IF(L$3<>\"\",L$3*VLOOKUP(L$2,'Technische Daten'!$A:$H,8,0),0)","v":0},{"$f":"IF(M$3<>\"\",M$3*VLOOKUP(M$2,'Technische Daten'!$A:$H,8,0),0)","v":0},{"$f":"IF(N$3<>\"\",N$3*VLOOKUP(N$2,'Technische Daten'!$A:$H,8,0),0)","v":0},{"$f":"IF(O$3<>\"\",O$3*VLOOKUP(O$2,'Technische Daten'!$A:$H,8,0),0)","v":0},{"$f":"IF(P$3<>\"\",P$3*VLOOKUP(P$2,'Technische Daten'!$A:$H,8,0),0)","v":0},{"$f":"IF(Q$3<>\"\",Q$3*VLOOKUP(Q$2,'Technische Daten'!$A:$H,8,0),0)","v":0},{"$f":"IF(R$3<>\"\",R$3*VLOOKUP(R$2,'Technische Daten'!$A:$H,8,0),0)","v":0},{"$f":"IF(S$3<>\"\",S$3*VLOOKUP(S$2,'Technische Daten'!$A:$H,8,0),0)","v":0},{"$f":"IF(T$3<>\"\",T$3*VLOOKUP(T$2,'Technische Daten'!$A:$H,8,0),0)","v":0},{"$f":"IF(U$3<>\"\",U$3*VLOOKUP(U$2,'Technische Daten'!$A:$H,8,0),0)","v":0},{"$f":"IF(V$3<>\"\",V$3*VLOOKUP(V$2,'Technische Daten'!$A:$H,8,0),0)","v":0},{"$f":"IF(W$3<>\"\",W$3*VLOOKUP(W$2,'Technische Daten'!$A:$H,8,0),0)","v":0},{"$f":"IF(X$3<>\"\",X$3*VLOOKUP(X$2,'Technische Daten'!$A:$H,8,0),0)","v":0},{"$f":"IF(Y$3<>\"\",Y$3*VLOOKUP(Y$2,'Technische Daten'!$A:$H,8,0),0)","v":0},{"$f":"IF(Z$3<>\"\",Z$3*VLOOKUP(Z$2,'Technische Daten'!$A:$H,8,0),0)","v":0},{"$f":"IF(AA$3<>\"\",AA$3*VLOOKUP(AA$2,'Technische Daten'!$A:$H,8,0),0)","v":0},{"$f":"IF(AB$3<>\"\",AB$3*VLOOKUP(AB$2,'Technische Daten'!$A:$H,8,0),0)","v":0},{"$f":"IF(AC$3<>\"\",AC$3*VLOOKUP(AC$2,'Technische Daten'!$A:$H,8,0),0)","v":0},{"$f":"IF(AD$3<>\"\",AD$3*VLOOKUP(AD$2,'Technische Daten'!$A:$H,8,0),0)","v":0},{"$f":"IF(AE$3<>\"\",AE$3*VLOOKUP(AE$2,'Technische Daten'!$A:$H,8,0),0)","v":0},{"$f":"IF(AF$3<>\"\",AF$3*VLOOKUP(AF$2,'Technische Daten'!$A:$H,8,0),0)","v":0},{"$f":"IF(AG$3<>\"\",AG$3*VLOOKUP(AG$2,'Technische Daten'!$A:$H,8,0),0)","v":0},{"$f":"IF(AH$3<>\"\",AH$3*VLOOKUP(AH$2,'Technische Daten'!$A:$H,8,0),0)","v":0},{"$f":"IF(AI$3<>\"\",AI$3*VLOOKUP(AI$2,'Technische Daten'!$A:$H,8,0),0)","v":0},{"$f":"IF(AJ$3<>\"\",AJ$3*VLOOKUP(AJ$2,'Technische Daten'!$A:$H,8,0),0)","v":0},{"$f":"IF(AK$3<>\"\",AK$3*VLOOKUP(AK$2,'Technische Daten'!$A:$H,8,0),0)","v":0},{"$f":"IF(AL$3<>\"\",AL$3*VLOOKUP(AL$2,'Technische Daten'!$A:$H,8,0),0)","v":0},{"$f":"IF(AM$3<>\"\",AM$3*VLOOKUP(AM$2,'Technische Daten'!$A:$H,8,0),0)","v":0},{"$f":"IF(AN$3<>\"\",AN$3*VLOOKUP(AN$2,'Technische Daten'!$A:$H,8,0),0)","v":0},{"$f":"IF(AO$3<>\"\",AO$3*VLOOKUP(AO$2,'Technische Daten'!$A:$H,8,0),0)","v":0},{"$f":"IF(AP$3<>\"\",AP$3*VLOOKUP(AP$2,'Technische Daten'!$A:$H,8,0),0)","v":0},{"$f":"IF(AQ$3<>\"\",AQ$3*VLOOKUP(AQ$2,'Technische Daten'!$A:$H,8,0),0)","v":0},{"$f":"IF(AR$3<>\"\",AR$3*VLOOKUP(AR$2,'Technische Daten'!$A:$H,8,0),0)","v":0},{"$f":"IF(AS$3<>\"\",AS$3*VLOOKUP(AS$2,'Technische Daten'!$A:$H,8,0),0)","v":0},{"$f":"IF(AT$3<>\"\",AT$3*VLOOKUP(AT$2,'Technische Daten'!$A:$H,8,0),0)","v":0},{"$f":"IF(AU$3<>\"\",AU$3*VLOOKUP(AU$2,'Technische Daten'!$A:$H,8,0),0)","v":0},{"$f":"IF(AV$3<>\"\",AV$3*VLOOKUP(AV$2,'Technische Daten'!$A:$H,8,0),0)","v":0},{"$f":"IF(AW$3<>\"\",AW$3*VLOOKUP(AW$2,'Technische Daten'!$A:$H,8,0),0)","v":0},{"$f":"IF(AX$3<>\"\",AX$3*VLOOKUP(AX$2,'Technische Daten'!$A:$H,8,0),0)","v":0}]
[{"$f":"Texte!B27","v":"Konfigurationscheck"},{"$f":"IF(AND(B41>=0, B42>=0, B43 >= 0),\"OK\",\"NOK\")","v":"OK"}]
[]
[{"$f":"Texte!B39","v":"Kommunikation (DeviceNet)"}]
[{"$f":"Texte!B24","v":"Anzahl verbleibende Rx-PDO (Byte)"},{"$f":"IF(SUM(C47:AX47)>0,ROUNDDOWN(SUM(C47:AX47)/8,0),ROUNDUP(SUM(C47:AX47)/8,0))","v":0},{"$f":"IF(C$3<>\"\",C$3*VLOOKUP(C$2,'Technische Daten'!$A:$G,6,0),0)","v":0},{"$f":"IF(D$3<>\"\",D$3*VLOOKUP(D$2,'Technische Daten'!$A:$G,6,0),0)","v":0},{"$f":"IF(E$3<>\"\",E$3*VLOOKUP(E$2,'Technische Daten'!$A:$G,6,0),0)","v":0},{"$f":"IF(F$3<>\"\",F$3*VLOOKUP(F$2,'Technische Daten'!$A:$G,6,0),0)","v":0},{"$f":"IF(G$3<>\"\",G$3*VLOOKUP(G$2,'Technische Daten'!$A:$G,6,0),0)","v":0},{"$f":"IF(H$3<>\"\",H$3*VLOOKUP(H$2,'Technische Daten'!$A:$G,6,0),0)","v":0},{"$f":"IF(I$3<>\"\",I$3*VLOOKUP(I$2,'Technische Daten'!$A:$G,6,0),0)","v":0},{"$f":"IF(J$3<>\"\",J$3*VLOOKUP(J$2,'Technische Daten'!$A:$G,6,0),0)","v":0},{"$f":"IF(K$3<>\"\",K$3*VLOOKUP(K$2,'Technische Daten'!$A:$G,6,0),0)","v":0},{"$f":"IF(L$3<>\"\",L$3*VLOOKUP(L$2,'Technische Daten'!$A:$G,6,0),0)","v":0},{"$f":"IF(M$3<>\"\",M$3*VLOOKUP(M$2,'Technische Daten'!$A:$G,6,0),0)","v":0},{"$f":"IF(N$3<>\"\",N$3*VLOOKUP(N$2,'Technische Daten'!$A:$G,6,0),0)","v":0},{"$f":"IF(O$3<>\"\",O$3*VLOOKUP(O$2,'Technische Daten'!$A:$G,6,0),0)","v":0},{"$f":"IF(P$3<>\"\",P$3*VLOOKUP(P$2,'Technische Daten'!$A:$G,6,0),0)","v":0},{"$f":"IF(Q$3<>\"\",Q$3*VLOOKUP(Q$2,'Technische Daten'!$A:$G,6,0),0)","v":0},{"$f":"IF(R$3<>\"\",R$3*VLOOKUP(R$2,'Technische Daten'!$A:$G,6,0),0)","v":0},{"$f":"IF(S$3<>\"\",S$3*VLOOKUP(S$2,'Technische Daten'!$A:$G,6,0),0)","v":0},{"$f":"IF(T$3<>\"\",T$3*VLOOKUP(T$2,'Technische Daten'!$A:$G,6,0),0)","v":0},{"$f":"IF(U$3<>\"\",U$3*VLOOKUP(U$2,'Technische Daten'!$A:$G,6,0),0)","v":0},{"$f":"IF(V$3<>\"\",V$3*VLOOKUP(V$2,'Technische Daten'!$A:$G,6,0),0)","v":0},{"$f":"IF(W$3<>\"\",W$3*VLOOKUP(W$2,'Technische Daten'!$A:$G,6,0),0)","v":0},{"$f":"IF(X$3<>\"\",X$3*VLOOKUP(X$2,'Technische Daten'!$A:$G,6,0),0)","v":0},{"$f":"IF(Y$3<>\"\",Y$3*VLOOKUP(Y$2,'Technische Daten'!$A:$G,6,0),0)","v":0},{"$f":"IF(Z$3<>\"\",Z$3*VLOOKUP(Z$2,'Technische Daten'!$A:$G,6,0),0)","v":0},{"$f":"IF(AA$3<>\"\",AA$3*VLOOKUP(AA$2,'Technische Daten'!$A:$G,6,0),0)","v":0},{"$f":"IF(AB$3<>\"\",AB$3*VLOOKUP(AB$2,'Technische Daten'!$A:$G,6,0),0)","v":0},{"$f":"IF(AC$3<>\"\",AC$3*VLOOKUP(AC$2,'Technische Daten'!$A:$G,6,0),0)","v":0},{"$f":"IF(AD$3<>\"\",AD$3*VLOOKUP(AD$2,'Technische Daten'!$A:$G,6,0),0)","v":0},{"$f":"IF(AE$3<>\"\",AE$3*VLOOKUP(AE$2,'Technische Daten'!$A:$G,6,0),0)","v":0},{"$f":"IF(AF$3<>\"\",AF$3*VLOOKUP(AF$2,'Technische Daten'!$A:$G,6,0),0)","v":0},{"$f":"IF(AG$3<>\"\",AG$3*VLOOKUP(AG$2,'Technische Daten'!$A:$G,6,0),0)","v":0},{"$f":"IF(AH$3<>\"\",AH$3*VLOOKUP(AH$2,'Technische Daten'!$A:$G,6,0),0)","v":0},{"$f":"IF(AI$3<>\"\",AI$3*VLOOKUP(AI$2,'Technische Daten'!$A:$G,6,0),0)","v":0},{"$f":"IF(AJ$3<>\"\",AJ$3*VLOOKUP(AJ$2,'Technische Daten'!$A:$G,6,0),0)","v":0},{"$f":"IF(AK$3<>\"\",AK$3*VLOOKUP(AK$2,'Technische Daten'!$A:$G,6,0),0)","v":0},{"$f":"IF(AL$3<>\"\",AL$3*VLOOKUP(AL$2,'Technische Daten'!$A:$G,6,0),0)","v":0},{"$f":"IF(AM$3<>\"\",AM$3*VLOOKUP(AM$2,'Technische Daten'!$A:$G,6,0),0)","v":0},{"$f":"IF(AN$3<>\"\",AN$3*VLOOKUP(AN$2,'Technische Daten'!$A:$G,6,0),0)","v":0},{"$f":"IF(AO$3<>\"\",AO$3*VLOOKUP(AO$2,'Technische Daten'!$A:$G,6,0),0)","v":0},{"$f":"IF(AP$3<>\"\",AP$3*VLOOKUP(AP$2,'Technische Daten'!$A:$G,6,0),0)","v":0},{"$f":"IF(AQ$3<>\"\",AQ$3*VLOOKUP(AQ$2,'Technische Daten'!$A:$G,6,0),0)","v":0},{"$f":"IF(AR$3<>\"\",AR$3*VLOOKUP(AR$2,'Technische Daten'!$A:$G,6,0),0)","v":0},{"$f":"IF(AS$3<>\"\",AS$3*VLOOKUP(AS$2,'Technische Daten'!$A:$G,6,0),0)","v":0},{"$f":"IF(AT$3<>\"\",AT$3*VLOOKUP(AT$2,'Technische Daten'!$A:$G,6,0),0)","v":0},{"$f":"IF(AU$3<>\"\",AU$3*VLOOKUP(AU$2,'Technische Daten'!$A:$G,6,0),0)","v":0},{"$f":"IF(AV$3<>\"\",AV$3*VLOOKUP(AV$2,'Technische Daten'!$A:$G,6,0),0)","v":0},{"$f":"IF(AW$3<>\"\",AW$3*VLOOKUP(AW$2,'Technische Daten'!$A:$G,6,0),0)","v":0},{"$f":"IF(AX$3<>\"\",AX$3*VLOOKUP(AX$2,'Technische Daten'!$A:$G,6,0),0)","v":0}]
[{"$f":"Texte!B25","v":"Anzahl verbleibende Tx-PDO (Byte)"},{"$f":"IF(SUM(C48:AX48)>0,ROUNDDOWN(SUM(C48:AX48)/8,0),ROUNDUP(SUM(C48:AX48)/8,0))","v":0},{"$f":"IF(C$3<>\"\",C$3*VLOOKUP(C$2,'Technische Daten'!$A:$G,7,0),0)","v":0},{"$f":"IF(D$3<>\"\",D$3*VLOOKUP(D$2,'Technische Daten'!$A:$G,7,0),0)","v":0},{"$f":"IF(E$3<>\"\",E$3*VLOOKUP(E$2,'Technische Daten'!$A:$G,7,0),0)","v":0},{"$f":"IF(F$3<>\"\",F$3*VLOOKUP(F$2,'Technische Daten'!$A:$G,7,0),0)","v":0},{"$f":"IF(G$3<>\"\",G$3*VLOOKUP(G$2,'Technische Daten'!$A:$G,7,0),0)","v":0},{"$f":"IF(H$3<>\"\",H$3*VLOOKUP(H$2,'Technische Daten'!$A:$G,7,0),0)","v":0},{"$f":"IF(I$3<>\"\",I$3*VLOOKUP(I$2,'Technische Daten'!$A:$G,7,0),0)","v":0},{"$f":"IF(J$3<>\"\",J$3*VLOOKUP(J$2,'Technische Daten'!$A:$G,7,0),0)","v":0},{"$f":"IF(K$3<>\"\",K$3*VLOOKUP(K$2,'Technische Daten'!$A:$G,7,0),0)","v":0},{"$f":"IF(L$3<>\"\",L$3*VLOOKUP(L$2,'Technische Daten'!$A:$G,7,0),0)","v":0},{"$f":"IF(M$3<>\"\",M$3*VLOOKUP(M$2,'Technische Daten'!$A:$G,7,0),0)","v":0},{"$f":"IF(N$3<>\"\",N$3*VLOOKUP(N$2,'Technische Daten'!$A:$G,7,0),0)","v":0},{"$f":"IF(O$3<>\"\",O$3*VLOOKUP(O$2,'Technische Daten'!$A:$G,7,0),0)","v":0},{"$f":"IF(P$3<>\"\",P$3*VLOOKUP(P$2,'Technische Daten'!$A:$G,7,0),0)","v":0},{"$f":"IF(Q$3<>\"\",Q$3*VLOOKUP(Q$2,'Technische Daten'!$A:$G,7,0),0)","v":0},{"$f":"IF(R$3<>\"\",R$3*VLOOKUP(R$2,'Technische Daten'!$A:$G,7,0),0)","v":0},{"$f":"IF(S$3<>\"\",S$3*VLOOKUP(S$2,'Technische Daten'!$A:$G,7,0),0)","v":0},{"$f":"IF(T$3<>\"\",T$3*VLOOKUP(T$2,'Technische Daten'!$A:$G,7,0),0)","v":0},{"$f":"IF(U$3<>\"\",U$3*VLOOKUP(U$2,'Technische Daten'!$A:$G,7,0),0)","v":0},{"$f":"IF(V$3<>\"\",V$3*VLOOKUP(V$2,'Technische Daten'!$A:$G,7,0),0)","v":0},{"$f":"IF(W$3<>\"\",W$3*VLOOKUP(W$2,'Technische Daten'!$A:$G,7,0),0)","v":0},{"$f":"IF(X$3<>\"\",X$3*VLOOKUP(X$2,'Technische Daten'!$A:$G,7,0),0)","v":0},{"$f":"IF(Y$3<>\"\",Y$3*VLOOKUP(Y$2,'Technische Daten'!$A:$G,7,0),0)","v":0},{"$f":"IF(Z$3<>\"\",Z$3*VLOOKUP(Z$2,'Technische Daten'!$A:$G,7,0),0)","v":0},{"$f":"IF(AA$3<>\"\",AA$3*VLOOKUP(AA$2,'Technische Daten'!$A:$G,7,0),0)","v":0},{"$f":"IF(AB$3<>\"\",AB$3*VLOOKUP(AB$2,'Technische Daten'!$A:$G,7,0),0)","v":0},{"$f":"IF(AC$3<>\"\",AC$3*VLOOKUP(AC$2,'Technische Daten'!$A:$G,7,0),0)","v":0},{"$f":"IF(AD$3<>\"\",AD$3*VLOOKUP(AD$2,'Technische Daten'!$A:$G,7,0),0)","v":0},{"$f":"IF(AE$3<>\"\",AE$3*VLOOKUP(AE$2,'Technische Daten'!$A:$G,7,0),0)","v":0},{"$f":"IF(AF$3<>\"\",AF$3*VLOOKUP(AF$2,'Technische Daten'!$A:$G,7,0),0)","v":0},{"$f":"IF(AG$3<>\"\",AG$3*VLOOKUP(AG$2,'Technische Daten'!$A:$G,7,0),0)","v":0},{"$f":"IF(AH$3<>\"\",AH$3*VLOOKUP(AH$2,'Technische Daten'!$A:$G,7,0),0)","v":0},{"$f":"IF(AI$3<>\"\",AI$3*VLOOKUP(AI$2,'Technische Daten'!$A:$G,7,0),0)","v":0},{"$f":"IF(AJ$3<>\"\",AJ$3*VLOOKUP(AJ$2,'Technische Daten'!$A:$G,7,0),0)","v":0},{"$f":"IF(AK$3<>\"\",AK$3*VLOOKUP(AK$2,'Technische Daten'!$A:$G,7,0),0)","v":0},{"$f":"IF(AL$3<>\"\",AL$3*VLOOKUP(AL$2,'Technische Daten'!$A:$G,7,0),0)","v":0},{"$f":"IF(AM$3<>\"\",AM$3*VLOOKUP(AM$2,'Technische Daten'!$A:$G,7,0),0)","v":0},{"$f":"IF(AN$3<>\"\",AN$3*VLOOKUP(AN$2,'Technische Daten'!$A:$G,7,0),0)","v":0},{"$f":"IF(AO$3<>\"\",AO$3*VLOOKUP(AO$2,'Technische Daten'!$A:$G,7,0),0)","v":0},{"$f":"IF(AP$3<>\"\",AP$3*VLOOKUP(AP$2,'Technische Daten'!$A:$G,7,0),0)","v":0},{"$f":"IF(AQ$3<>\"\",AQ$3*VLOOKUP(AQ$2,'Technische Daten'!$A:$G,7,0),0)","v":0},{"$f":"IF(AR$3<>\"\",AR$3*VLOOKUP(AR$2,'Technische Daten'!$A:$G,7,0),0)","v":0},{"$f":"IF(AS$3<>\"\",AS$3*VLOOKUP(AS$2,'Technische Daten'!$A:$G,7,0),0)","v":0},{"$f":"IF(AT$3<>\"\",AT$3*VLOOKUP(AT$2,'Technische Daten'!$A:$G,7,0),0)","v":0},{"$f":"IF(AU$3<>\"\",AU$3*VLOOKUP(AU$2,'Technische Daten'!$A:$G,7,0),0)","v":0},{"$f":"IF(AV$3<>\"\",AV$3*VLOOKUP(AV$2,'Technische Daten'!$A:$G,7,0),0)","v":0},{"$f":"IF(AW$3<>\"\",AW$3*VLOOKUP(AW$2,'Technische Daten'!$A:$G,7,0),0)","v":0},{"$f":"IF(AX$3<>\"\",AX$3*VLOOKUP(AX$2,'Technische Daten'!$A:$G,7,0),0)","v":0}]
[{"$f":"Texte!B27","v":"Konfigurationscheck"},{"$f":"IF(AND(B47>=0, B48>=0),\"OK\",\"NOK\")","v":"OK"}]
[]
[{"$f":"Texte!B40","v":"Kommunikation (Modbus TCP)"}]
[{"$f":"Texte!B24","v":"Anzahl verbleibende Rx-PDO (Byte)"},{"$f":"IF(SUM(C52:AX52)>0,ROUNDDOWN(SUM(C52:AX52)/8,0),ROUNDUP(SUM(C52:AX52)/8,0))","v":0},{"$f":"IF(C$3<>\"\",C$3*VLOOKUP(C$2,'Technische Daten'!$A:$G,6,0),0)","v":0},{"$f":"IF(D$3<>\"\",D$3*VLOOKUP(D$2,'Technische Daten'!$A:$G,6,0),0)","v":0},{"$f":"IF(E$3<>\"\",E$3*VLOOKUP(E$2,'Technische Daten'!$A:$G,6,0),0)","v":0},{"$f":"IF(F$3<>\"\",F$3*VLOOKUP(F$2,'Technische Daten'!$A:$G,6,0),0)","v":0},{"$f":"IF(G$3<>\"\",G$3*VLOOKUP(G$2,'Technische Daten'!$A:$G,6,0),0)","v":0},{"$f":"IF(H$3<>\"\",H$3*VLOOKUP(H$2,'Technische Daten'!$A:$G,6,0),0)","v":0},{"$f":"IF(I$3<>\"\",I$3*VLOOKUP(I$2,'Technische Daten'!$A:$G,6,0),0)","v":0},{"$f":"IF(J$3<>\"\",J$3*VLOOKUP(J$2,'Technische Daten'!$A:$G,6,0),0)","v":0},{"$f":"IF(K$3<>\"\",K$3*VLOOKUP(K$2,'Technische Daten'!$A:$G,6,0),0)","v":0},{"$f":"IF(L$3<>\"\",L$3*VLOOKUP(L$2,'Technische Daten'!$A:$G,6,0),0)","v":0},{"$f":"IF(M$3<>\"\",M$3*VLOOKUP(M$2,'Technische Daten'!$A:$G,6,0),0)","v":0},{"$f":"IF(N$3<>\"\",N$3*VLOOKUP(N$2,'Technische Daten'!$A:$G,6,0),0)","v":0},{"$f":"IF(O$3<>\"\",O$3*VLOOKUP(O$2,'Technische Daten'!$A:$G,6,0),0)","v":0},{"$f":"IF(P$3<>\"\",P$3*VLOOKUP(P$2,'Technische Daten'!$A:$G,6,0),0)","v":0},{"$f":"IF(Q$3<>\"\",Q$3*VLOOKUP(Q$2,'Technische Daten'!$A:$G,6,0),0)","v":0},{"$f":"IF(R$3<>\"\",R$3*VLOOKUP(R$2,'Technische Daten'!$A:$G,6,0),0)","v":0},{"$f":"IF(S$3<>\"\",S$3*VLOOKUP(S$2,'Technische Daten'!$A:$G,6,0),0)","v":0},{"$f":"IF(T$3<>\"\",T$3*VLOOKUP(T$2,'Technische Daten'!$A:$G,6,0),0)","v":0},{"$f":"IF(U$3<>\"\",U$3*VLOOKUP(U$2,'Technische Daten'!$A:$G,6,0),0)","v":0},{"$f":"IF(V$3<>\"\",V$3*VLOOKUP(V$2,'Technische Daten'!$A:$G,6,0),0)","v":0},{"$f":"IF(W$3<>\"\",W$3*VLOOKUP(W$2,'Technische Daten'!$A:$G,6,0),0)","v":0},{"$f":"IF(X$3<>\"\",X$3*VLOOKUP(X$2,'Technische Daten'!$A:$G,6,0),0)","v":0},{"$f":"IF(Y$3<>\"\",Y$3*VLOOKUP(Y$2,'Technische Daten'!$A:$G,6,0),0)","v":0},{"$f":"IF(Z$3<>\"\",Z$3*VLOOKUP(Z$2,'Technische Daten'!$A:$G,6,0),0)","v":0},{"$f":"IF(AA$3<>\"\",AA$3*VLOOKUP(AA$2,'Technische Daten'!$A:$G,6,0),0)","v":0},{"$f":"IF(AB$3<>\"\",AB$3*VLOOKUP(AB$2,'Technische Daten'!$A:$G,6,0),0)","v":0},{"$f":"IF(AC$3<>\"\",AC$3*VLOOKUP(AC$2,'Technische Daten'!$A:$G,6,0),0)","v":0},{"$f":"IF(AD$3<>\"\",AD$3*VLOOKUP(AD$2,'Technische Daten'!$A:$G,6,0),0)","v":0},{"$f":"IF(AE$3<>\"\",AE$3*VLOOKUP(AE$2,'Technische Daten'!$A:$G,6,0),0)","v":0},{"$f":"IF(AF$3<>\"\",AF$3*VLOOKUP(AF$2,'Technische Daten'!$A:$G,6,0),0)","v":0},{"$f":"IF(AG$3<>\"\",AG$3*VLOOKUP(AG$2,'Technische Daten'!$A:$G,6,0),0)","v":0},{"$f":"IF(AH$3<>\"\",AH$3*VLOOKUP(AH$2,'Technische Daten'!$A:$G,6,0),0)","v":0},{"$f":"IF(AI$3<>\"\",AI$3*VLOOKUP(AI$2,'Technische Daten'!$A:$G,6,0),0)","v":0},{"$f":"IF(AJ$3<>\"\",AJ$3*VLOOKUP(AJ$2,'Technische Daten'!$A:$G,6,0),0)","v":0},{"$f":"IF(AK$3<>\"\",AK$3*VLOOKUP(AK$2,'Technische Daten'!$A:$G,6,0),0)","v":0},{"$f":"IF(AL$3<>\"\",AL$3*VLOOKUP(AL$2,'Technische Daten'!$A:$G,6,0),0)","v":0},{"$f":"IF(AM$3<>\"\",AM$3*VLOOKUP(AM$2,'Technische Daten'!$A:$G,6,0),0)","v":0},{"$f":"IF(AN$3<>\"\",AN$3*VLOOKUP(AN$2,'Technische Daten'!$A:$G,6,0),0)","v":0},{"$f":"IF(AO$3<>\"\",AO$3*VLOOKUP(AO$2,'Technische Daten'!$A:$G,6,0),0)","v":0},{"$f":"IF(AP$3<>\"\",AP$3*VLOOKUP(AP$2,'Technische Daten'!$A:$G,6,0),0)","v":0},{"$f":"IF(AQ$3<>\"\",AQ$3*VLOOKUP(AQ$2,'Technische Daten'!$A:$G,6,0),0)","v":0},{"$f":"IF(AR$3<>\"\",AR$3*VLOOKUP(AR$2,'Technische Daten'!$A:$G,6,0),0)","v":0},{"$f":"IF(AS$3<>\"\",AS$3*VLOOKUP(AS$2,'Technische Daten'!$A:$G,6,0),0)","v":0},{"$f":"IF(AT$3<>\"\",AT$3*VLOOKUP(AT$2,'Technische Daten'!$A:$G,6,0),0)","v":0},{"$f":"IF(AU$3<>\"\",AU$3*VLOOKUP(AU$2,'Technische Daten'!$A:$G,6,0),0)","v":0},{"$f":"IF(AV$3<>\"\",AV$3*VLOOKUP(AV$2,'Technische Daten'!$A:$G,6,0),0)","v":0},{"$f":"IF(AW$3<>\"\",AW$3*VLOOKUP(AW$2,'Technische Daten'!$A:$G,6,0),0)","v":0},{"$f":"IF(AX$3<>\"\",AX$3*VLOOKUP(AX$2,'Technische Daten'!$A:$G,6,0),0)","v":0}]
[{"$f":"Texte!B25","v":"Anzahl verbleibende Tx-PDO (Byte)"},{"$f":"IF(SUM(C53:AX53)>0,ROUNDDOWN(SUM(C53:AX53)/8,0),ROUNDUP(SUM(C53:AX53)/8,0))","v":0},{"$f":"IF(C$3<>\"\",C$3*VLOOKUP(C$2,'Technische Daten'!$A:$G,7,0),0)","v":0},{"$f":"IF(D$3<>\"\",D$3*VLOOKUP(D$2,'Technische Daten'!$A:$G,7,0),0)","v":0},{"$f":"IF(E$3<>\"\",E$3*VLOOKUP(E$2,'Technische Daten'!$A:$G,7,0),0)","v":0},{"$f":"IF(F$3<>\"\",F$3*VLOOKUP(F$2,'Technische Daten'!$A:$G,7,0),0)","v":0},{"$f":"IF(G$3<>\"\",G$3*VLOOKUP(G$2,'Technische Daten'!$A:$G,7,0),0)","v":0},{"$f":"IF(H$3<>\"\",H$3*VLOOKUP(H$2,'Technische Daten'!$A:$G,7,0),0)","v":0},{"$f":"IF(I$3<>\"\",I$3*VLOOKUP(I$2,'Technische Daten'!$A:$G,7,0),0)","v":0},{"$f":"IF(J$3<>\"\",J$3*VLOOKUP(J$2,'Technische Daten'!$A:$G,7,0),0)","v":0},{"$f":"IF(K$3<>\"\",K$3*VLOOKUP(K$2,'Technische Daten'!$A:$G,7,0),0)","v":0},{"$f":"IF(L$3<>\"\",L$3*VLOOKUP(L$2,'Technische Daten'!$A:$G,7,0),0)","v":0},{"$f":"IF(M$3<>\"\",M$3*VLOOKUP(M$2,'Technische Daten'!$A:$G,7,0),0)","v":0},{"$f":"IF(N$3<>\"\",N$3*VLOOKUP(N$2,'Technische Daten'!$A:$G,7,0),0)","v":0},{"$f":"IF(O$3<>\"\",O$3*VLOOKUP(O$2,'Technische Daten'!$A:$G,7,0),0)","v":0},{"$f":"IF(P$3<>\"\",P$3*VLOOKUP(P$2,'Technische Daten'!$A:$G,7,0),0)","v":0},{"$f":"IF(Q$3<>\"\",Q$3*VLOOKUP(Q$2,'Technische Daten'!$A:$G,7,0),0)","v":0},{"$f":"IF(R$3<>\"\",R$3*VLOOKUP(R$2,'Technische Daten'!$A:$G,7,0),0)","v":0},{"$f":"IF(S$3<>\"\",S$3*VLOOKUP(S$2,'Technische Daten'!$A:$G,7,0),0)","v":0},{"$f":"IF(T$3<>\"\",T$3*VLOOKUP(T$2,'Technische Daten'!$A:$G,7,0),0)","v":0},{"$f":"IF(U$3<>\"\",U$3*VLOOKUP(U$2,'Technische Daten'!$A:$G,7,0),0)","v":0},{"$f":"IF(V$3<>\"\",V$3*VLOOKUP(V$2,'Technische Daten'!$A:$G,7,0),0)","v":0},{"$f":"IF(W$3<>\"\",W$3*VLOOKUP(W$2,'Technische Daten'!$A:$G,7,0),0)","v":0},{"$f":"IF(X$3<>\"\",X$3*VLOOKUP(X$2,'Technische Daten'!$A:$G,7,0),0)","v":0},{"$f":"IF(Y$3<>\"\",Y$3*VLOOKUP(Y$2,'Technische Daten'!$A:$G,7,0),0)","v":0},{"$f":"IF(Z$3<>\"\",Z$3*VLOOKUP(Z$2,'Technische Daten'!$A:$G,7,0),0)","v":0},{"$f":"IF(AA$3<>\"\",AA$3*VLOOKUP(AA$2,'Technische Daten'!$A:$G,7,0),0)","v":0},{"$f":"IF(AB$3<>\"\",AB$3*VLOOKUP(AB$2,'Technische Daten'!$A:$G,7,0),0)","v":0},{"$f":"IF(AC$3<>\"\",AC$3*VLOOKUP(AC$2,'Technische Daten'!$A:$G,7,0),0)","v":0},{"$f":"IF(AD$3<>\"\",AD$3*VLOOKUP(AD$2,'Technische Daten'!$A:$G,7,0),0)","v":0},{"$f":"IF(AE$3<>\"\",AE$3*VLOOKUP(AE$2,'Technische Daten'!$A:$G,7,0),0)","v":0},{"$f":"IF(AF$3<>\"\",AF$3*VLOOKUP(AF$2,'Technische Daten'!$A:$G,7,0),0)","v":0},{"$f":"IF(AG$3<>\"\",AG$3*VLOOKUP(AG$2,'Technische Daten'!$A:$G,7,0),0)","v":0},{"$f":"IF(AH$3<>\"\",AH$3*VLOOKUP(AH$2,'Technische Daten'!$A:$G,7,0),0)","v":0},{"$f":"IF(AI$3<>\"\",AI$3*VLOOKUP(AI$2,'Technische Daten'!$A:$G,7,0),0)","v":0},{"$f":"IF(AJ$3<>\"\",AJ$3*VLOOKUP(AJ$2,'Technische Daten'!$A:$G,7,0),0)","v":0},{"$f":"IF(AK$3<>\"\",AK$3*VLOOKUP(AK$2,'Technische Daten'!$A:$G,7,0),0)","v":0},{"$f":"IF(AL$3<>\"\",AL$3*VLOOKUP(AL$2,'Technische Daten'!$A:$G,7,0),0)","v":0},{"$f":"IF(AM$3<>\"\",AM$3*VLOOKUP(AM$2,'Technische Daten'!$A:$G,7,0),0)","v":0},{"$f":"IF(AN$3<>\"\",AN$3*VLOOKUP(AN$2,'Technische Daten'!$A:$G,7,0),0)","v":0},{"$f":"IF(AO$3<>\"\",AO$3*VLOOKUP(AO$2,'Technische Daten'!$A:$G,7,0),0)","v":0},{"$f":"IF(AP$3<>\"\",AP$3*VLOOKUP(AP$2,'Technische Daten'!$A:$G,7,0),0)","v":0},{"$f":"IF(AQ$3<>\"\",AQ$3*VLOOKUP(AQ$2,'Technische Daten'!$A:$G,7,0),0)","v":0},{"$f":"IF(AR$3<>\"\",AR$3*VLOOKUP(AR$2,'Technische Daten'!$A:$G,7,0),0)","v":0},{"$f":"IF(AS$3<>\"\",AS$3*VLOOKUP(AS$2,'Technische Daten'!$A:$G,7,0),0)","v":0},{"$f":"IF(AT$3<>\"\",AT$3*VLOOKUP(AT$2,'Technische Daten'!$A:$G,7,0),0)","v":0},{"$f":"IF(AU$3<>\"\",AU$3*VLOOKUP(AU$2,'Technische Daten'!$A:$G,7,0),0)","v":0},{"$f":"IF(AV$3<>\"\",AV$3*VLOOKUP(AV$2,'Technische Daten'!$A:$G,7,0),0)","v":0},{"$f":"IF(AW$3<>\"\",AW$3*VLOOKUP(AW$2,'Technische Daten'!$A:$G,7,0),0)","v":0},{"$f":"IF(AX$3<>\"\",AX$3*VLOOKUP(AX$2,'Technische Daten'!$A:$G,7,0),0)","v":0}]
[{"$f":"Texte!B27","v":"Konfigurationscheck"},{"$f":"IF(AND(B52>=0, B53>=0),\"OK\",\"NOK\")","v":"OK"}]
[]
[{"$f":"Texte!B41","v":"Kommunikation (Rückwandbus)"}]
[{"$f":"Texte!B42","v":"Auslastung Rückwandbus"},{"$f":"B104","v":0.20429999999999995}]
[{"$f":"Texte!B27","v":"Konfigurationscheck"},{"$f":"IF(B57<= 100%,\"OK\",\"NOK\")","v":"OK"}]
[]
[{"$f":"Texte!B33","v":"Übersicht"}]
[{"$f":"Texte!B34","v":"Gesamtanzahl Module (ohne Versorgung) "},{"$f":"SUM(J3:AR3)","v":0}]
[{"$f":"Texte!B35","v":"Gesamtanzahl digitale Eingänge"},{"$f":"SUM(C62:AX62)","v":0},{"$f":"IF(C$3<>\"\",C$3*VLOOKUP(C$2,'Technische Daten'!$A:$L,9,0),0)","v":0},{"$f":"IF(D$3<>\"\",D$3*VLOOKUP(D$2,'Technische Daten'!$A:$L,9,0),0)","v":0},{"$f":"IF(E$3<>\"\",E$3*VLOOKUP(E$2,'Technische Daten'!$A:$L,9,0),0)","v":0},{"$f":"IF(F$3<>\"\",F$3*VLOOKUP(F$2,'Technische Daten'!$A:$L,9,0),0)","v":0},{"$f":"IF(G$3<>\"\",G$3*VLOOKUP(G$2,'Technische Daten'!$A:$L,9,0),0)","v":0},{"$f":"IF(H$3<>\"\",H$3*VLOOKUP(H$2,'Technische Daten'!$A:$L,9,0),0)","v":0},{"$f":"IF(I$3<>\"\",I$3*VLOOKUP(I$2,'Technische Daten'!$A:$L,9,0),0)","v":0},{"$f":"IF(J$3<>\"\",J$3*VLOOKUP(J$2,'Technische Daten'!$A:$L,9,0),0)","v":0},{"$f":"IF(K$3<>\"\",K$3*VLOOKUP(K$2,'Technische Daten'!$A:$L,9,0),0)","v":0},{"$f":"IF(L$3<>\"\",L$3*VLOOKUP(L$2,'Technische Daten'!$A:$L,9,0),0)","v":0},{"$f":"IF(M$3<>\"\",M$3*VLOOKUP(M$2,'Technische Daten'!$A:$L,9,0),0)","v":0},{"$f":"IF(N$3<>\"\",N$3*VLOOKUP(N$2,'Technische Daten'!$A:$L,9,0),0)","v":0},{"$f":"IF(O$3<>\"\",O$3*VLOOKUP(O$2,'Technische Daten'!$A:$L,9,0),0)","v":0},{"$f":"IF(P$3<>\"\",P$3*VLOOKUP(P$2,'Technische Daten'!$A:$L,9,0),0)","v":0},{"$f":"IF(Q$3<>\"\",Q$3*VLOOKUP(Q$2,'Technische Daten'!$A:$L,9,0),0)","v":0},{"$f":"IF(R$3<>\"\",R$3*VLOOKUP(R$2,'Technische Daten'!$A:$L,9,0),0)","v":0},{"$f":"IF(S$3<>\"\",S$3*VLOOKUP(S$2,'Technische Daten'!$A:$L,9,0),0)","v":0},{"$f":"IF(T$3<>\"\",T$3*VLOOKUP(T$2,'Technische Daten'!$A:$L,9,0),0)","v":0},{"$f":"IF(U$3<>\"\",U$3*VLOOKUP(U$2,'Technische Daten'!$A:$L,9,0),0)","v":0},{"$f":"IF(V$3<>\"\",V$3*VLOOKUP(V$2,'Technische Daten'!$A:$L,9,0),0)","v":0},{"$f":"IF(W$3<>\"\",W$3*VLOOKUP(W$2,'Technische Daten'!$A:$L,9,0),0)","v":0},{"$f":"IF(X$3<>\"\",X$3*VLOOKUP(X$2,'Technische Daten'!$A:$L,9,0),0)","v":0},{"$f":"IF(Y$3<>\"\",Y$3*VLOOKUP(Y$2,'Technische Daten'!$A:$L,9,0),0)","v":0},{"$f":"IF(Z$3<>\"\",Z$3*VLOOKUP(Z$2,'Technische Daten'!$A:$L,9,0),0)","v":0},{"$f":"IF(AA$3<>\"\",AA$3*VLOOKUP(AA$2,'Technische Daten'!$A:$L,9,0),0)","v":0},{"$f":"IF(AB$3<>\"\",AB$3*VLOOKUP(AB$2,'Technische Daten'!$A:$L,9,0),0)","v":0},{"$f":"IF(AC$3<>\"\",AC$3*VLOOKUP(AC$2,'Technische Daten'!$A:$L,9,0),0)","v":0},{"$f":"IF(AD$3<>\"\",AD$3*VLOOKUP(AD$2,'Technische Daten'!$A:$L,9,0),0)","v":0},{"$f":"IF(AE$3<>\"\",AE$3*VLOOKUP(AE$2,'Technische Daten'!$A:$L,9,0),0)","v":0},{"$f":"IF(AF$3<>\"\",AF$3*VLOOKUP(AF$2,'Technische Daten'!$A:$L,9,0),0)","v":0},{"$f":"IF(AG$3<>\"\",AG$3*VLOOKUP(AG$2,'Technische Daten'!$A:$L,9,0),0)","v":0},{"$f":"IF(AH$3<>\"\",AH$3*VLOOKUP(AH$2,'Technische Daten'!$A:$L,9,0),0)","v":0},{"$f":"IF(AI$3<>\"\",AI$3*VLOOKUP(AI$2,'Technische Daten'!$A:$L,9,0),0)","v":0},{"$f":"IF(AJ$3<>\"\",AJ$3*VLOOKUP(AJ$2,'Technische Daten'!$A:$L,9,0),0)","v":0},{"$f":"IF(AK$3<>\"\",AK$3*VLOOKUP(AK$2,'Technische Daten'!$A:$L,9,0),0)","v":0},{"$f":"IF(AL$3<>\"\",AL$3*VLOOKUP(AL$2,'Technische Daten'!$A:$L,9,0),0)","v":0},{"$f":"IF(AM$3<>\"\",AM$3*VLOOKUP(AM$2,'Technische Daten'!$A:$L,9,0),0)","v":0},{"$f":"IF(AN$3<>\"\",AN$3*VLOOKUP(AN$2,'Technische Daten'!$A:$L,9,0),0)","v":0},{"$f":"IF(AO$3<>\"\",AO$3*VLOOKUP(AO$2,'Technische Daten'!$A:$L,9,0),0)","v":0},{"$f":"IF(AP$3<>\"\",AP$3*VLOOKUP(AP$2,'Technische Daten'!$A:$L,9,0),0)","v":0},{"$f":"IF(AQ$3<>\"\",AQ$3*VLOOKUP(AQ$2,'Technische Daten'!$A:$L,9,0),0)","v":0},{"$f":"IF(AR$3<>\"\",AR$3*VLOOKUP(AR$2,'Technische Daten'!$A:$L,9,0),0)","v":0},{"$f":"IF(AS$3<>\"\",AS$3*VLOOKUP(AS$2,'Technische Daten'!$A:$L,9,0),0)","v":0},{"$f":"IF(AT$3<>\"\",AT$3*VLOOKUP(AT$2,'Technische Daten'!$A:$L,9,0),0)","v":0},{"$f":"IF(AU$3<>\"\",AU$3*VLOOKUP(AU$2,'Technische Daten'!$A:$L,9,0),0)","v":0},{"$f":"IF(AV$3<>\"\",AV$3*VLOOKUP(AV$2,'Technische Daten'!$A:$L,9,0),0)","v":0},{"$f":"IF(AW$3<>\"\",AW$3*VLOOKUP(AW$2,'Technische Daten'!$A:$L,9,0),0)","v":0},{"$f":"IF(AX$3<>\"\",AX$3*VLOOKUP(AX$2,'Technische Daten'!$A:$L,9,0),0)","v":0}]
[{"$f":"Texte!B36","v":"Gesamtanzahl digitale Ausgänge"},{"$f":"SUM(C63:AX63)","v":0},{"$f":"IF(C$3<>\"\",C$3*VLOOKUP(C$2,'Technische Daten'!$A:$L,10,0),0)","v":0},{"$f":"IF(D$3<>\"\",D$3*VLOOKUP(D$2,'Technische Daten'!$A:$L,10,0),0)","v":0},{"$f":"IF(E$3<>\"\",E$3*VLOOKUP(E$2,'Technische Daten'!$A:$L,10,0),0)","v":0},{"$f":"IF(F$3<>\"\",F$3*VLOOKUP(F$2,'Technische Daten'!$A:$L,10,0),0)","v":0},{"$f":"IF(G$3<>\"\",G$3*VLOOKUP(G$2,'Technische Daten'!$A:$L,10,0),0)","v":0},{"$f":"IF(H$3<>\"\",H$3*VLOOKUP(H$2,'Technische Daten'!$A:$L,10,0),0)","v":0},{"$f":"IF(I$3<>\"\",I$3*VLOOKUP(I$2,'Technische Daten'!$A:$L,10,0),0)","v":0},{"$f":"IF(J$3<>\"\",J$3*VLOOKUP(J$2,'Technische Daten'!$A:$L,10,0),0)","v":0},{"$f":"IF(K$3<>\"\",K$3*VLOOKUP(K$2,'Technische Daten'!$A:$L,10,0),0)","v":0},{"$f":"IF(L$3<>\"\",L$3*VLOOKUP(L$2,'Technische Daten'!$A:$L,10,0),0)","v":0},{"$f":"IF(M$3<>\"\",M$3*VLOOKUP(M$2,'Technische Daten'!$A:$L,10,0),0)","v":0},{"$f":"IF(N$3<>\"\",N$3*VLOOKUP(N$2,'Technische Daten'!$A:$L,10,0),0)","v":0},{"$f":"IF(O$3<>\"\",O$3*VLOOKUP(O$2,'Technische Daten'!$A:$L,10,0),0)","v":0},{"$f":"IF(P$3<>\"\",P$3*VLOOKUP(P$2,'Technische Daten'!$A:$L,10,0),0)","v":0},{"$f":"IF(Q$3<>\"\",Q$3*VLOOKUP(Q$2,'Technische Daten'!$A:$L,10,0),0)","v":0},{"$f":"IF(R$3<>\"\",R$3*VLOOKUP(R$2,'Technische Daten'!$A:$L,10,0),0)","v":0},{"$f":"IF(S$3<>\"\",S$3*VLOOKUP(S$2,'Technische Daten'!$A:$L,10,0),0)","v":0},{"$f":"IF(T$3<>\"\",T$3*VLOOKUP(T$2,'Technische Daten'!$A:$L,10,0),0)","v":0},{"$f":"IF(U$3<>\"\",U$3*VLOOKUP(U$2,'Technische Daten'!$A:$L,10,0),0)","v":0},{"$f":"IF(V$3<>\"\",V$3*VLOOKUP(V$2,'Technische Daten'!$A:$L,10,0),0)","v":0},{"$f":"IF(W$3<>\"\",W$3*VLOOKUP(W$2,'Technische Daten'!$A:$L,10,0),0)","v":0},{"$f":"IF(X$3<>\"\",X$3*VLOOKUP(X$2,'Technische Daten'!$A:$L,10,0),0)","v":0},{"$f":"IF(Y$3<>\"\",Y$3*VLOOKUP(Y$2,'Technische Daten'!$A:$L,10,0),0)","v":0},{"$f":"IF(Z$3<>\"\",Z$3*VLOOKUP(Z$2,'Technische Daten'!$A:$L,10,0),0)","v":0},{"$f":"IF(AA$3<>\"\",AA$3*VLOOKUP(AA$2,'Technische Daten'!$A:$L,10,0),0)","v":0},{"$f":"IF(AB$3<>\"\",AB$3*VLOOKUP(AB$2,'Technische Daten'!$A:$L,10,0),0)","v":0},{"$f":"IF(AC$3<>\"\",AC$3*VLOOKUP(AC$2,'Technische Daten'!$A:$L,10,0),0)","v":0},{"$f":"IF(AD$3<>\"\",AD$3*VLOOKUP(AD$2,'Technische Daten'!$A:$L,10,0),0)","v":0},{"$f":"IF(AE$3<>\"\",AE$3*VLOOKUP(AE$2,'Technische Daten'!$A:$L,10,0),0)","v":0},{"$f":"IF(AF$3<>\"\",AF$3*VLOOKUP(AF$2,'Technische Daten'!$A:$L,10,0),0)","v":0},{"$f":"IF(AG$3<>\"\",AG$3*VLOOKUP(AG$2,'Technische Daten'!$A:$L,10,0),0)","v":0},{"$f":"IF(AH$3<>\"\",AH$3*VLOOKUP(AH$2,'Technische Daten'!$A:$L,10,0),0)","v":0},{"$f":"IF(AI$3<>\"\",AI$3*VLOOKUP(AI$2,'Technische Daten'!$A:$L,10,0),0)","v":0},{"$f":"IF(AJ$3<>\"\",AJ$3*VLOOKUP(AJ$2,'Technische Daten'!$A:$L,10,0),0)","v":0},{"$f":"IF(AK$3<>\"\",AK$3*VLOOKUP(AK$2,'Technische Daten'!$A:$L,10,0),0)","v":0},{"$f":"IF(AL$3<>\"\",AL$3*VLOOKUP(AL$2,'Technische Daten'!$A:$L,10,0),0)","v":0},{"$f":"IF(AM$3<>\"\",AM$3*VLOOKUP(AM$2,'Technische Daten'!$A:$L,10,0),0)","v":0},{"$f":"IF(AN$3<>\"\",AN$3*VLOOKUP(AN$2,'Technische Daten'!$A:$L,10,0),0)","v":0},{"$f":"IF(AO$3<>\"\",AO$3*VLOOKUP(AO$2,'Technische Daten'!$A:$L,10,0),0)","v":0},{"$f":"IF(AP$3<>\"\",AP$3*VLOOKUP(AP$2,'Technische Daten'!$A:$L,10,0),0)","v":0},{"$f":"IF(AQ$3<>\"\",AQ$3*VLOOKUP(AQ$2,'Technische Daten'!$A:$L,10,0),0)","v":0},{"$f":"IF(AR$3<>\"\",AR$3*VLOOKUP(AR$2,'Technische Daten'!$A:$L,10,0),0)","v":0},{"$f":"IF(AS$3<>\"\",AS$3*VLOOKUP(AS$2,'Technische Daten'!$A:$L,10,0),0)","v":0},{"$f":"IF(AT$3<>\"\",AT$3*VLOOKUP(AT$2,'Technische Daten'!$A:$L,10,0),0)","v":0},{"$f":"IF(AU$3<>\"\",AU$3*VLOOKUP(AU$2,'Technische Daten'!$A:$L,10,0),0)","v":0},{"$f":"IF(AV$3<>\"\",AV$3*VLOOKUP(AV$2,'Technische Daten'!$A:$L,10,0),0)","v":0},{"$f":"IF(AW$3<>\"\",AW$3*VLOOKUP(AW$2,'Technische Daten'!$A:$L,10,0),0)","v":0},{"$f":"IF(AX$3<>\"\",AX$3*VLOOKUP(AX$2,'Technische Daten'!$A:$L,10,0),0)","v":0}]
[{"$f":"Texte!B37","v":"Gesamtanzahl analoge Eingänge"},{"$f":"SUM(C64:AX64)","v":0},{"$f":"IF(C$3<>\"\",C$3*VLOOKUP(C$2,'Technische Daten'!$A:$L,11,0),0)","v":0},{"$f":"IF(D$3<>\"\",D$3*VLOOKUP(D$2,'Technische Daten'!$A:$L,11,0),0)","v":0},{"$f":"IF(E$3<>\"\",E$3*VLOOKUP(E$2,'Technische Daten'!$A:$L,11,0),0)","v":0},{"$f":"IF(F$3<>\"\",F$3*VLOOKUP(F$2,'Technische Daten'!$A:$L,11,0),0)","v":0},{"$f":"IF(G$3<>\"\",G$3*VLOOKUP(G$2,'Technische Daten'!$A:$L,11,0),0)","v":0},{"$f":"IF(H$3<>\"\",H$3*VLOOKUP(H$2,'Technische Daten'!$A:$L,11,0),0)","v":0},{"$f":"IF(I$3<>\"\",I$3*VLOOKUP(I$2,'Technische Daten'!$A:$L,11,0),0)","v":0},{"$f":"IF(J$3<>\"\",J$3*VLOOKUP(J$2,'Technische Daten'!$A:$L,11,0),0)","v":0},{"$f":"IF(K$3<>\"\",K$3*VLOOKUP(K$2,'Technische Daten'!$A:$L,11,0),0)","v":0},{"$f":"IF(L$3<>\"\",L$3*VLOOKUP(L$2,'Technische Daten'!$A:$L,11,0),0)","v":0},{"$f":"IF(M$3<>\"\",M$3*VLOOKUP(M$2,'Technische Daten'!$A:$L,11,0),0)","v":0},{"$f":"IF(N$3<>\"\",N$3*VLOOKUP(N$2,'Technische Daten'!$A:$L,11,0),0)","v":0},{"$f":"IF(O$3<>\"\",O$3*VLOOKUP(O$2,'Technische Daten'!$A:$L,11,0),0)","v":0},{"$f":"IF(P$3<>\"\",P$3*VLOOKUP(P$2,'Technische Daten'!$A:$L,11,0),0)","v":0},{"$f":"IF(Q$3<>\"\",Q$3*VLOOKUP(Q$2,'Technische Daten'!$A:$L,11,0),0)","v":0},{"$f":"IF(R$3<>\"\",R$3*VLOOKUP(R$2,'Technische Daten'!$A:$L,11,0),0)","v":0},{"$f":"IF(S$3<>\"\",S$3*VLOOKUP(S$2,'Technische Daten'!$A:$L,11,0),0)","v":0},{"$f":"IF(T$3<>\"\",T$3*VLOOKUP(T$2,'Technische Daten'!$A:$L,11,0),0)","v":0},{"$f":"IF(U$3<>\"\",U$3*VLOOKUP(U$2,'Technische Daten'!$A:$L,11,0),0)","v":0},{"$f":"IF(V$3<>\"\",V$3*VLOOKUP(V$2,'Technische Daten'!$A:$L,11,0),0)","v":0},{"$f":"IF(W$3<>\"\",W$3*VLOOKUP(W$2,'Technische Daten'!$A:$L,11,0),0)","v":0},{"$f":"IF(X$3<>\"\",X$3*VLOOKUP(X$2,'Technische Daten'!$A:$L,11,0),0)","v":0},{"$f":"IF(Y$3<>\"\",Y$3*VLOOKUP(Y$2,'Technische Daten'!$A:$L,11,0),0)","v":0},{"$f":"IF(Z$3<>\"\",Z$3*VLOOKUP(Z$2,'Technische Daten'!$A:$L,11,0),0)","v":0},{"$f":"IF(AA$3<>\"\",AA$3*VLOOKUP(AA$2,'Technische Daten'!$A:$L,11,0),0)","v":0},{"$f":"IF(AB$3<>\"\",AB$3*VLOOKUP(AB$2,'Technische Daten'!$A:$L,11,0),0)","v":0},{"$f":"IF(AC$3<>\"\",AC$3*VLOOKUP(AC$2,'Technische Daten'!$A:$L,11,0),0)","v":0},{"$f":"IF(AD$3<>\"\",AD$3*VLOOKUP(AD$2,'Technische Daten'!$A:$L,11,0),0)","v":0},{"$f":"IF(AE$3<>\"\",AE$3*VLOOKUP(AE$2,'Technische Daten'!$A:$L,11,0),0)","v":0},{"$f":"IF(AF$3<>\"\",AF$3*VLOOKUP(AF$2,'Technische Daten'!$A:$L,11,0),0)","v":0},{"$f":"IF(AG$3<>\"\",AG$3*VLOOKUP(AG$2,'Technische Daten'!$A:$L,11,0),0)","v":0},{"$f":"IF(AH$3<>\"\",AH$3*VLOOKUP(AH$2,'Technische Daten'!$A:$L,11,0),0)","v":0},{"$f":"IF(AI$3<>\"\",AI$3*VLOOKUP(AI$2,'Technische Daten'!$A:$L,11,0),0)","v":0},{"$f":"IF(AJ$3<>\"\",AJ$3*VLOOKUP(AJ$2,'Technische Daten'!$A:$L,11,0),0)","v":0},{"$f":"IF(AK$3<>\"\",AK$3*VLOOKUP(AK$2,'Technische Daten'!$A:$L,11,0),0)","v":0},{"$f":"IF(AL$3<>\"\",AL$3*VLOOKUP(AL$2,'Technische Daten'!$A:$L,11,0),0)","v":0},{"$f":"IF(AM$3<>\"\",AM$3*VLOOKUP(AM$2,'Technische Daten'!$A:$L,11,0),0)","v":0},{"$f":"IF(AN$3<>\"\",AN$3*VLOOKUP(AN$2,'Technische Daten'!$A:$L,11,0),0)","v":0},{"$f":"IF(AO$3<>\"\",AO$3*VLOOKUP(AO$2,'Technische Daten'!$A:$L,11,0),0)","v":0},{"$f":"IF(AP$3<>\"\",AP$3*VLOOKUP(AP$2,'Technische Daten'!$A:$L,11,0),0)","v":0},{"$f":"IF(AQ$3<>\"\",AQ$3*VLOOKUP(AQ$2,'Technische Daten'!$A:$L,11,0),0)","v":0},{"$f":"IF(AR$3<>\"\",AR$3*VLOOKUP(AR$2,'Technische Daten'!$A:$L,11,0),0)","v":0},{"$f":"IF(AS$3<>\"\",AS$3*VLOOKUP(AS$2,'Technische Daten'!$A:$L,11,0),0)","v":0},{"$f":"IF(AT$3<>\"\",AT$3*VLOOKUP(AT$2,'Technische Daten'!$A:$L,11,0),0)","v":0},{"$f":"IF(AU$3<>\"\",AU$3*VLOOKUP(AU$2,'Technische Daten'!$A:$L,11,0),0)","v":0},{"$f":"IF(AV$3<>\"\",AV$3*VLOOKUP(AV$2,'Technische Daten'!$A:$L,11,0),0)","v":0},{"$f":"IF(AW$3<>\"\",AW$3*VLOOKUP(AW$2,'Technische Daten'!$A:$L,11,0),0)","v":0},{"$f":"IF(AX$3<>\"\",AX$3*VLOOKUP(AX$2,'Technische Daten'!$A:$L,11,0),0)","v":0}]
[{"$f":"Texte!B38","v":"Gesamtanzahl analoge Ausgänge"},{"$f":"SUM(C65:AX65)","v":0},{"$f":"IF(C$3<>\"\",C$3*VLOOKUP(C$2,'Technische Daten'!$A:$L,12,0),0)","v":0},{"$f":"IF(D$3<>\"\",D$3*VLOOKUP(D$2,'Technische Daten'!$A:$L,12,0),0)","v":0},{"$f":"IF(E$3<>\"\",E$3*VLOOKUP(E$2,'Technische Daten'!$A:$L,12,0),0)","v":0},{"$f":"IF(F$3<>\"\",F$3*VLOOKUP(F$2,'Technische Daten'!$A:$L,12,0),0)","v":0},{"$f":"IF(G$3<>\"\",G$3*VLOOKUP(G$2,'Technische Daten'!$A:$L,12,0),0)","v":0},{"$f":"IF(H$3<>\"\",H$3*VLOOKUP(H$2,'Technische Daten'!$A:$L,12,0),0)","v":0},{"$f":"IF(I$3<>\"\",I$3*VLOOKUP(I$2,'Technische Daten'!$A:$L,12,0),0)","v":0},{"$f":"IF(J$3<>\"\",J$3*VLOOKUP(J$2,'Technische Daten'!$A:$L,12,0),0)","v":0},{"$f":"IF(K$3<>\"\",K$3*VLOOKUP(K$2,'Technische Daten'!$A:$L,12,0),0)","v":0},{"$f":"IF(L$3<>\"\",L$3*VLOOKUP(L$2,'Technische Daten'!$A:$L,12,0),0)","v":0},{"$f":"IF(M$3<>\"\",M$3*VLOOKUP(M$2,'Technische Daten'!$A:$L,12,0),0)","v":0},{"$f":"IF(N$3<>\"\",N$3*VLOOKUP(N$2,'Technische Daten'!$A:$L,12,0),0)","v":0},{"$f":"IF(O$3<>\"\",O$3*VLOOKUP(O$2,'Technische Daten'!$A:$L,12,0),0)","v":0},{"$f":"IF(P$3<>\"\",P$3*VLOOKUP(P$2,'Technische Daten'!$A:$L,12,0),0)","v":0},{"$f":"IF(Q$3<>\"\",Q$3*VLOOKUP(Q$2,'Technische Daten'!$A:$L,12,0),0)","v":0},{"$f":"IF(R$3<>\"\",R$3*VLOOKUP(R$2,'Technische Daten'!$A:$L,12,0),0)","v":0},{"$f":"IF(S$3<>\"\",S$3*VLOOKUP(S$2,'Technische Daten'!$A:$L,12,0),0)","v":0},{"$f":"IF(T$3<>\"\",T$3*VLOOKUP(T$2,'Technische Daten'!$A:$L,12,0),0)","v":0},{"$f":"IF(U$3<>\"\",U$3*VLOOKUP(U$2,'Technische Daten'!$A:$L,12,0),0)","v":0},{"$f":"IF(V$3<>\"\",V$3*VLOOKUP(V$2,'Technische Daten'!$A:$L,12,0),0)","v":0},{"$f":"IF(W$3<>\"\",W$3*VLOOKUP(W$2,'Technische Daten'!$A:$L,12,0),0)","v":0},{"$f":"IF(X$3<>\"\",X$3*VLOOKUP(X$2,'Technische Daten'!$A:$L,12,0),0)","v":0},{"$f":"IF(Y$3<>\"\",Y$3*VLOOKUP(Y$2,'Technische Daten'!$A:$L,12,0),0)","v":0},{"$f":"IF(Z$3<>\"\",Z$3*VLOOKUP(Z$2,'Technische Daten'!$A:$L,12,0),0)","v":0},{"$f":"IF(AA$3<>\"\",AA$3*VLOOKUP(AA$2,'Technische Daten'!$A:$L,12,0),0)","v":0},{"$f":"IF(AB$3<>\"\",AB$3*VLOOKUP(AB$2,'Technische Daten'!$A:$L,12,0),0)","v":0},{"$f":"IF(AC$3<>\"\",AC$3*VLOOKUP(AC$2,'Technische Daten'!$A:$L,12,0),0)","v":0},{"$f":"IF(AD$3<>\"\",AD$3*VLOOKUP(AD$2,'Technische Daten'!$A:$L,12,0),0)","v":0},{"$f":"IF(AE$3<>\"\",AE$3*VLOOKUP(AE$2,'Technische Daten'!$A:$L,12,0),0)","v":0},{"$f":"IF(AF$3<>\"\",AF$3*VLOOKUP(AF$2,'Technische Daten'!$A:$L,12,0),0)","v":0},{"$f":"IF(AG$3<>\"\",AG$3*VLOOKUP(AG$2,'Technische Daten'!$A:$L,12,0),0)","v":0},{"$f":"IF(AH$3<>\"\",AH$3*VLOOKUP(AH$2,'Technische Daten'!$A:$L,12,0),0)","v":0},{"$f":"IF(AI$3<>\"\",AI$3*VLOOKUP(AI$2,'Technische Daten'!$A:$L,12,0),0)","v":0},{"$f":"IF(AJ$3<>\"\",AJ$3*VLOOKUP(AJ$2,'Technische Daten'!$A:$L,12,0),0)","v":0},{"$f":"IF(AK$3<>\"\",AK$3*VLOOKUP(AK$2,'Technische Daten'!$A:$L,12,0),0)","v":0},{"$f":"IF(AL$3<>\"\",AL$3*VLOOKUP(AL$2,'Technische Daten'!$A:$L,12,0),0)","v":0},{"$f":"IF(AM$3<>\"\",AM$3*VLOOKUP(AM$2,'Technische Daten'!$A:$L,12,0),0)","v":0},{"$f":"IF(AN$3<>\"\",AN$3*VLOOKUP(AN$2,'Technische Daten'!$A:$L,12,0),0)","v":0},{"$f":"IF(AO$3<>\"\",AO$3*VLOOKUP(AO$2,'Technische Daten'!$A:$L,12,0),0)","v":0},{"$f":"IF(AP$3<>\"\",AP$3*VLOOKUP(AP$2,'Technische Daten'!$A:$L,12,0),0)","v":0},{"$f":"IF(AQ$3<>\"\",AQ$3*VLOOKUP(AQ$2,'Technische Daten'!$A:$L,12,0),0)","v":0},{"$f":"IF(AR$3<>\"\",AR$3*VLOOKUP(AR$2,'Technische Daten'!$A:$L,12,0),0)","v":0},{"$f":"IF(AS$3<>\"\",AS$3*VLOOKUP(AS$2,'Technische Daten'!$A:$L,12,0),0)","v":0},{"$f":"IF(AT$3<>\"\",AT$3*VLOOKUP(AT$2,'Technische Daten'!$A:$L,12,0),0)","v":0},{"$f":"IF(AU$3<>\"\",AU$3*VLOOKUP(AU$2,'Technische Daten'!$A:$L,12,0),0)","v":0},{"$f":"IF(AV$3<>\"\",AV$3*VLOOKUP(AV$2,'Technische Daten'!$A:$L,12,0),0)","v":0},{"$f":"IF(AW$3<>\"\",AW$3*VLOOKUP(AW$2,'Technische Daten'!$A:$L,12,0),0)","v":0},{"$f":"IF(AX$3<>\"\",AX$3*VLOOKUP(AX$2,'Technische Daten'!$A:$L,12,0),0)","v":0}]
[]
[{"$f":"Texte!B112","v":"Mechanische Abmaße"}]
[{"$f":"Texte!B113","v":"Breite (mm)"},{"$f":"SUM(C68:AX68)","v":0},{"$f":"IF(C$3<>\"\",C$3*VLOOKUP(C$2,'Technische Daten'!$A:$Z,26,0),0)","v":0},{"$f":"IF(D$3<>\"\",D$3*VLOOKUP(D$2,'Technische Daten'!$A:$Z,26,0),0)","v":0},{"$f":"IF(E$3<>\"\",E$3*VLOOKUP(E$2,'Technische Daten'!$A:$Z,26,0),0)","v":0},{"$f":"IF(F$3<>\"\",F$3*VLOOKUP(F$2,'Technische Daten'!$A:$Z,26,0),0)","v":0},{"$f":"IF(G$3<>\"\",G$3*VLOOKUP(G$2,'Technische Daten'!$A:$Z,26,0),0)","v":0},{"$f":"IF(H$3<>\"\",H$3*VLOOKUP(H$2,'Technische Daten'!$A:$Z,26,0),0)","v":0},{"$f":"IF(I$3<>\"\",I$3*VLOOKUP(I$2,'Technische Daten'!$A:$Z,26,0),0)","v":0},{"$f":"IF(J$3<>\"\",J$3*VLOOKUP(J$2,'Technische Daten'!$A:$Z,26,0),0)","v":0},{"$f":"IF(K$3<>\"\",K$3*VLOOKUP(K$2,'Technische Daten'!$A:$Z,26,0),0)","v":0},{"$f":"IF(L$3<>\"\",L$3*VLOOKUP(L$2,'Technische Daten'!$A:$Z,26,0),0)","v":0},{"$f":"IF(M$3<>\"\",M$3*VLOOKUP(M$2,'Technische Daten'!$A:$Z,26,0),0)","v":0},{"$f":"IF(N$3<>\"\",N$3*VLOOKUP(N$2,'Technische Daten'!$A:$Z,26,0),0)","v":0},{"$f":"IF(O$3<>\"\",O$3*VLOOKUP(O$2,'Technische Daten'!$A:$Z,26,0),0)","v":0},{"$f":"IF(P$3<>\"\",P$3*VLOOKUP(P$2,'Technische Daten'!$A:$Z,26,0),0)","v":0},{"$f":"IF(Q$3<>\"\",Q$3*VLOOKUP(Q$2,'Technische Daten'!$A:$Z,26,0),0)","v":0},{"$f":"IF(R$3<>\"\",R$3*VLOOKUP(R$2,'Technische Daten'!$A:$Z,26,0),0)","v":0},{"$f":"IF(S$3<>\"\",S$3*VLOOKUP(S$2,'Technische Daten'!$A:$Z,26,0),0)","v":0},{"$f":"IF(T$3<>\"\",T$3*VLOOKUP(T$2,'Technische Daten'!$A:$Z,26,0),0)","v":0},{"$f":"IF(U$3<>\"\",U$3*VLOOKUP(U$2,'Technische Daten'!$A:$Z,26,0),0)","v":0},{"$f":"IF(V$3<>\"\",V$3*VLOOKUP(V$2,'Technische Daten'!$A:$Z,26,0),0)","v":0},{"$f":"IF(W$3<>\"\",W$3*VLOOKUP(W$2,'Technische Daten'!$A:$Z,26,0),0)","v":0},{"$f":"IF(X$3<>\"\",X$3*VLOOKUP(X$2,'Technische Daten'!$A:$Z,26,0),0)","v":0},{"$f":"IF(Y$3<>\"\",Y$3*VLOOKUP(Y$2,'Technische Daten'!$A:$Z,26,0),0)","v":0},{"$f":"IF(Z$3<>\"\",Z$3*VLOOKUP(Z$2,'Technische Daten'!$A:$Z,26,0),0)","v":0},{"$f":"IF(AA$3<>\"\",AA$3*VLOOKUP(AA$2,'Technische Daten'!$A:$Z,26,0),0)","v":0},{"$f":"IF(AB$3<>\"\",AB$3*VLOOKUP(AB$2,'Technische Daten'!$A:$Z,26,0),0)","v":0},{"$f":"IF(AC$3<>\"\",AC$3*VLOOKUP(AC$2,'Technische Daten'!$A:$Z,26,0),0)","v":0},{"$f":"IF(AD$3<>\"\",AD$3*VLOOKUP(AD$2,'Technische Daten'!$A:$Z,26,0),0)","v":0},{"$f":"IF(AE$3<>\"\",AE$3*VLOOKUP(AE$2,'Technische Daten'!$A:$Z,26,0),0)","v":0},{"$f":"IF(AF$3<>\"\",AF$3*VLOOKUP(AF$2,'Technische Daten'!$A:$Z,26,0),0)","v":0},{"$f":"IF(AG$3<>\"\",AG$3*VLOOKUP(AG$2,'Technische Daten'!$A:$Z,26,0),0)","v":0},{"$f":"IF(AH$3<>\"\",AH$3*VLOOKUP(AH$2,'Technische Daten'!$A:$Z,26,0),0)","v":0},{"$f":"IF(AI$3<>\"\",AI$3*VLOOKUP(AI$2,'Technische Daten'!$A:$Z,26,0),0)","v":0},{"$f":"IF(AJ$3<>\"\",AJ$3*VLOOKUP(AJ$2,'Technische Daten'!$A:$Z,26,0),0)","v":0},{"$f":"IF(AK$3<>\"\",AK$3*VLOOKUP(AK$2,'Technische Daten'!$A:$Z,26,0),0)","v":0},{"$f":"IF(AL$3<>\"\",AL$3*VLOOKUP(AL$2,'Technische Daten'!$A:$Z,26,0),0)","v":0},{"$f":"IF(AM$3<>\"\",AM$3*VLOOKUP(AM$2,'Technische Daten'!$A:$Z,26,0),0)","v":0},{"$f":"IF(AN$3<>\"\",AN$3*VLOOKUP(AN$2,'Technische Daten'!$A:$Z,26,0),0)","v":0},{"$f":"IF(AO$3<>\"\",AO$3*VLOOKUP(AO$2,'Technische Daten'!$A:$Z,26,0),0)","v":0},{"$f":"IF(AP$3<>\"\",AP$3*VLOOKUP(AP$2,'Technische Daten'!$A:$Z,26,0),0)","v":0},{"$f":"IF(AQ$3<>\"\",AQ$3*VLOOKUP(AQ$2,'Technische Daten'!$A:$Z,26,0),0)","v":0},{"$f":"IF(AR$3<>\"\",AR$3*VLOOKUP(AR$2,'Technische Daten'!$A:$Z,26,0),0)","v":0},{"$f":"IF(AS$3<>\"\",AS$3*VLOOKUP(AS$2,'Technische Daten'!$A:$Z,26,0),0)","v":0},{"$f":"IF(AT$3<>\"\",AT$3*VLOOKUP(AT$2,'Technische Daten'!$A:$Z,26,0),0)","v":0},{"$f":"IF(AU$3<>\"\",AU$3*VLOOKUP(AU$2,'Technische Daten'!$A:$Z,26,0),0)","v":0},{"$f":"IF(AV$3<>\"\",AV$3*VLOOKUP(AV$2,'Technische Daten'!$A:$Z,26,0),0)","v":0},{"$f":"IF(AW$3<>\"\",AW$3*VLOOKUP(AW$2,'Technische Daten'!$A:$Z,26,0),0)","v":0},{"$f":"IF(AX$3<>\"\",AX$3*VLOOKUP(AX$2,'Technische Daten'!$A:$Z,26,0),0)","v":0}]
[]
[]
[]
["ab hier Hilfszeilen"]
[{"$f":"Texte!B107","v":"7A"}]
[{"$f":"Texte!B108","v":"10A"}]
[]
["CAN Drive-based"]
["Summe DI TX",{"$f":"ROUNDUP(ROUNDUP(SUM(C77:AX77)/8,0) /8,0) * 8","v":0},{"$f":"IF(AND(C$3<>\"\", VLOOKUP(C$2,'Technische Daten'!$A:$P,9,0) <> 0,VLOOKUP(C$2,'Technische Daten'!$A:$AA,27,0) = 1),C$3*VLOOKUP(C$2,'Technische Daten'!$A:$P,15,0),0)","v":0},{"$f":"IF(AND(D$3<>\"\", VLOOKUP(D$2,'Technische Daten'!$A:$P,9,0) <> 0,VLOOKUP(D$2,'Technische Daten'!$A:$AA,27,0) = 1),D$3*VLOOKUP(D$2,'Technische Daten'!$A:$P,15,0),0)","v":0},{"$f":"IF(AND(E$3<>\"\", VLOOKUP(E$2,'Technische Daten'!$A:$P,9,0) <> 0,VLOOKUP(E$2,'Technische Daten'!$A:$AA,27,0) = 1),E$3*VLOOKUP(E$2,'Technische Daten'!$A:$P,15,0),0)","v":0},{"$f":"IF(AND(F$3<>\"\", VLOOKUP(F$2,'Technische Daten'!$A:$P,9,0) <> 0,VLOOKUP(F$2,'Technische Daten'!$A:$AA,27,0) = 1),F$3*VLOOKUP(F$2,'Technische Daten'!$A:$P,15,0),0)","v":0},{"$f":"IF(AND(G$3<>\"\", VLOOKUP(G$2,'Technische Daten'!$A:$P,9,0) <> 0,VLOOKUP(G$2,'Technische Daten'!$A:$AA,27,0) = 1),G$3*VLOOKUP(G$2,'Technische Daten'!$A:$P,15,0),0)","v":0},{"$f":"IF(AND(H$3<>\"\", VLOOKUP(H$2,'Technische Daten'!$A:$P,9,0) <> 0,VLOOKUP(H$2,'Technische Daten'!$A:$AA,27,0) = 1),H$3*VLOOKUP(H$2,'Technische Daten'!$A:$P,15,0),0)","v":0},{"$f":"IF(AND(I$3<>\"\", VLOOKUP(I$2,'Technische Daten'!$A:$P,9,0) <> 0,VLOOKUP(I$2,'Technische Daten'!$A:$AA,27,0) = 1),I$3*VLOOKUP(I$2,'Technische Daten'!$A:$P,15,0),0)","v":0},{"$f":"IF(AND(J$3<>\"\", VLOOKUP(J$2,'Technische Daten'!$A:$P,9,0) <> 0,VLOOKUP(J$2,'Technische Daten'!$A:$AA,27,0) = 1),J$3*VLOOKUP(J$2,'Technische Daten'!$A:$P,15,0),0)","v":0},{"$f":"IF(AND(K$3<>\"\", VLOOKUP(K$2,'Technische Daten'!$A:$P,9,0) <> 0,VLOOKUP(K$2,'Technische Daten'!$A:$AA,27,0) = 1),K$3*VLOOKUP(K$2,'Technische Daten'!$A:$P,15,0),0)","v":0},{"$f":"IF(AND(L$3<>\"\", VLOOKUP(L$2,'Technische Daten'!$A:$P,9,0) <> 0,VLOOKUP(L$2,'Technische Daten'!$A:$AA,27,0) = 1),L$3*VLOOKUP(L$2,'Technische Daten'!$A:$P,15,0),0)","v":0},{"$f":"IF(AND(M$3<>\"\", VLOOKUP(M$2,'Technische Daten'!$A:$P,9,0) <> 0,VLOOKUP(M$2,'Technische Daten'!$A:$AA,27,0) = 1),M$3*VLOOKUP(M$2,'Technische Daten'!$A:$P,15,0),0)","v":0},{"$f":"IF(AND(N$3<>\"\", VLOOKUP(N$2,'Technische Daten'!$A:$P,9,0) <> 0,VLOOKUP(N$2,'Technische Daten'!$A:$AA,27,0) = 1),N$3*VLOOKUP(N$2,'Technische Daten'!$A:$P,15,0),0)","v":0},{"$f":"IF(AND(O$3<>\"\", VLOOKUP(O$2,'Technische Daten'!$A:$P,9,0) <> 0,VLOOKUP(O$2,'Technische Daten'!$A:$AA,27,0) = 1),O$3*VLOOKUP(O$2,'Technische Daten'!$A:$P,15,0),0)","v":0},{"$f":"IF(AND(P$3<>\"\", VLOOKUP(P$2,'Technische Daten'!$A:$P,9,0) <> 0,VLOOKUP(P$2,'Technische Daten'!$A:$AA,27,0) = 1),P$3*VLOOKUP(P$2,'Technische Daten'!$A:$P,15,0),0)","v":0},{"$f":"IF(AND(Q$3<>\"\", VLOOKUP(Q$2,'Technische Daten'!$A:$P,9,0) <> 0,VLOOKUP(Q$2,'Technische Daten'!$A:$AA,27,0) = 1),Q$3*VLOOKUP(Q$2,'Technische Daten'!$A:$P,15,0),0)","v":0},{"$f":"IF(AND(R$3<>\"\", VLOOKUP(R$2,'Technische Daten'!$A:$P,9,0) <> 0,VLOOKUP(R$2,'Technische Daten'!$A:$AA,27,0) = 1),R$3*VLOOKUP(R$2,'Technische Daten'!$A:$P,15,0),0)","v":0},{"$f":"IF(AND(S$3<>\"\", VLOOKUP(S$2,'Technische Daten'!$A:$P,9,0) <> 0,VLOOKUP(S$2,'Technische Daten'!$A:$AA,27,0) = 1),S$3*VLOOKUP(S$2,'Technische Daten'!$A:$P,15,0),0)","v":0},{"$f":"IF(AND(T$3<>\"\", VLOOKUP(T$2,'Technische Daten'!$A:$P,9,0) <> 0,VLOOKUP(T$2,'Technische Daten'!$A:$AA,27,0) = 1),T$3*VLOOKUP(T$2,'Technische Daten'!$A:$P,15,0),0)","v":0},{"$f":"IF(AND(U$3<>\"\", VLOOKUP(U$2,'Technische Daten'!$A:$P,9,0) <> 0,VLOOKUP(U$2,'Technische Daten'!$A:$AA,27,0) = 1),U$3*VLOOKUP(U$2,'Technische Daten'!$A:$P,15,0),0)","v":0},{"$f":"IF(AND(V$3<>\"\", VLOOKUP(V$2,'Technische Daten'!$A:$P,9,0) <> 0,VLOOKUP(V$2,'Technische Daten'!$A:$AA,27,0) = 1),V$3*VLOOKUP(V$2,'Technische Daten'!$A:$P,15,0),0)","v":0},{"$f":"IF(AND(W$3<>\"\", VLOOKUP(W$2,'Technische Daten'!$A:$P,9,0) <> 0,VLOOKUP(W$2,'Technische Daten'!$A:$AA,27,0) = 1),W$3*VLOOKUP(W$2,'Technische Daten'!$A:$P,15,0),0)","v":0},{"$f":"IF(AND(X$3<>\"\", VLOOKUP(X$2,'Technische Daten'!$A:$P,9,0) <> 0,VLOOKUP(X$2,'Technische Daten'!$A:$AA,27,0) = 1),X$3*VLOOKUP(X$2,'Technische Daten'!$A:$P,15,0),0)","v":0},{"$f":"IF(AND(Y$3<>\"\", VLOOKUP(Y$2,'Technische Daten'!$A:$P,9,0) <> 0,VLOOKUP(Y$2,'Technische Daten'!$A:$AA,27,0) = 1),Y$3*VLOOKUP(Y$2,'Technische Daten'!$A:$P,15,0),0)","v":0},{"$f":"IF(AND(Z$3<>\"\", VLOOKUP(Z$2,'Technische Daten'!$A:$P,9,0) <> 0,VLOOKUP(Z$2,'Technische Daten'!$A:$AA,27,0) = 1),Z$3*VLOOKUP(Z$2,'Technische Daten'!$A:$P,15,0),0)","v":0},{"$f":"IF(AND(AA$3<>\"\", VLOOKUP(AA$2,'Technische Daten'!$A:$P,9,0) <> 0,VLOOKUP(AA$2,'Technische Daten'!$A:$AA,27,0) = 1),AA$3*VLOOKUP(AA$2,'Technische Daten'!$A:$P,15,0),0)","v":0},{"$f":"IF(AND(AB$3<>\"\", VLOOKUP(AB$2,'Technische Daten'!$A:$P,9,0) <> 0,VLOOKUP(AB$2,'Technische Daten'!$A:$AA,27,0) = 1),AB$3*VLOOKUP(AB$2,'Technische Daten'!$A:$P,15,0),0)","v":0},{"$f":"IF(AND(AC$3<>\"\", VLOOKUP(AC$2,'Technische Daten'!$A:$P,9,0) <> 0,VLOOKUP(AC$2,'Technische Daten'!$A:$AA,27,0) = 1),AC$3*VLOOKUP(AC$2,'Technische Daten'!$A:$P,15,0),0)","v":0},{"$f":"IF(AND(AD$3<>\"\", VLOOKUP(AD$2,'Technische Daten'!$A:$P,9,0) <> 0,VLOOKUP(AD$2,'Technische Daten'!$A:$AA,27,0) = 1),AD$3*VLOOKUP(AD$2,'Technische Daten'!$A:$P,15,0),0)","v":0},{"$f":"IF(AND(AE$3<>\"\", VLOOKUP(AE$2,'Technische Daten'!$A:$P,9,0) <> 0,VLOOKUP(AE$2,'Technische Daten'!$A:$AA,27,0) = 1),AE$3*VLOOKUP(AE$2,'Technische Daten'!$A:$P,15,0),0)","v":0},{"$f":"IF(AND(AF$3<>\"\", VLOOKUP(AF$2,'Technische Daten'!$A:$P,9,0) <> 0,VLOOKUP(AF$2,'Technische Daten'!$A:$AA,27,0) = 1),AF$3*VLOOKUP(AF$2,'Technische Daten'!$A:$P,15,0),0)","v":0},{"$f":"IF(AND(AG$3<>\"\", VLOOKUP(AG$2,'Technische Daten'!$A:$P,9,0) <> 0,VLOOKUP(AG$2,'Technische Daten'!$A:$AA,27,0) = 1),AG$3*VLOOKUP(AG$2,'Technische Daten'!$A:$P,15,0),0)","v":0},{"$f":"IF(AND(AH$3<>\"\", VLOOKUP(AH$2,'Technische Daten'!$A:$P,9,0) <> 0,VLOOKUP(AH$2,'Technische Daten'!$A:$AA,27,0) = 1),AH$3*VLOOKUP(AH$2,'Technische Daten'!$A:$P,15,0),0)","v":0},{"$f":"IF(AND(AI$3<>\"\", VLOOKUP(AI$2,'Technische Daten'!$A:$P,9,0) <> 0,VLOOKUP(AI$2,'Technische Daten'!$A:$AA,27,0) = 1),AI$3*VLOOKUP(AI$2,'Technische Daten'!$A:$P,15,0),0)","v":0},{"$f":"IF(AND(AJ$3<>\"\", VLOOKUP(AJ$2,'Technische Daten'!$A:$P,9,0) <> 0,VLOOKUP(AJ$2,'Technische Daten'!$A:$AA,27,0) = 1),AJ$3*VLOOKUP(AJ$2,'Technische Daten'!$A:$P,15,0),0)","v":0},{"$f":"IF(AND(AK$3<>\"\", VLOOKUP(AK$2,'Technische Daten'!$A:$P,9,0) <> 0,VLOOKUP(AK$2,'Technische Daten'!$A:$AA,27,0) = 1),AK$3*VLOOKUP(AK$2,'Technische Daten'!$A:$P,15,0),0)","v":0},{"$f":"IF(AND(AL$3<>\"\", VLOOKUP(AL$2,'Technische Daten'!$A:$P,9,0) <> 0,VLOOKUP(AL$2,'Technische Daten'!$A:$AA,27,0) = 1),AL$3*VLOOKUP(AL$2,'Technische Daten'!$A:$P,15,0),0)","v":0},{"$f":"IF(AND(AM$3<>\"\", VLOOKUP(AM$2,'Technische Daten'!$A:$P,9,0) <> 0,VLOOKUP(AM$2,'Technische Daten'!$A:$AA,27,0) = 1),AM$3*VLOOKUP(AM$2,'Technische Daten'!$A:$P,15,0),0)","v":0},{"$f":"IF(AND(AN$3<>\"\", VLOOKUP(AN$2,'Technische Daten'!$A:$P,9,0) <> 0,VLOOKUP(AN$2,'Technische Daten'!$A:$AA,27,0) = 1),AN$3*VLOOKUP(AN$2,'Technische Daten'!$A:$P,15,0),0)","v":0},{"$f":"IF(AND(AO$3<>\"\", VLOOKUP(AO$2,'Technische Daten'!$A:$P,9,0) <> 0,VLOOKUP(AO$2,'Technische Daten'!$A:$AA,27,0) = 1),AO$3*VLOOKUP(AO$2,'Technische Daten'!$A:$P,15,0),0)","v":0},{"$f":"IF(AND(AP$3<>\"\", VLOOKUP(AP$2,'Technische Daten'!$A:$P,9,0) <> 0,VLOOKUP(AP$2,'Technische Daten'!$A:$AA,27,0) = 1),AP$3*VLOOKUP(AP$2,'Technische Daten'!$A:$P,15,0),0)","v":0},{"$f":"IF(AND(AQ$3<>\"\", VLOOKUP(AQ$2,'Technische Daten'!$A:$P,9,0) <> 0,VLOOKUP(AQ$2,'Technische Daten'!$A:$AA,27,0) = 1),AQ$3*VLOOKUP(AQ$2,'Technische Daten'!$A:$P,15,0),0)","v":0},{"$f":"IF(AND(AR$3<>\"\", VLOOKUP(AR$2,'Technische Daten'!$A:$P,9,0) <> 0,VLOOKUP(AR$2,'Technische Daten'!$A:$AA,27,0) = 1),AR$3*VLOOKUP(AR$2,'Technische Daten'!$A:$P,15,0),0)","v":0},{"$f":"IF(AND(AS$3<>\"\", VLOOKUP(AS$2,'Technische Daten'!$A:$P,9,0) <> 0,VLOOKUP(AS$2,'Technische Daten'!$A:$AA,27,0) = 1),AS$3*VLOOKUP(AS$2,'Technische Daten'!$A:$P,15,0),0)","v":0},{"$f":"IF(AND(AT$3<>\"\", VLOOKUP(AT$2,'Technische Daten'!$A:$P,9,0) <> 0,VLOOKUP(AT$2,'Technische Daten'!$A:$AA,27,0) = 1),AT$3*VLOOKUP(AT$2,'Technische Daten'!$A:$P,15,0),0)","v":0},{"$f":"IF(AND(AU$3<>\"\", VLOOKUP(AU$2,'Technische Daten'!$A:$P,9,0) <> 0,VLOOKUP(AU$2,'Technische Daten'!$A:$AA,27,0) = 1),AU$3*VLOOKUP(AU$2,'Technische Daten'!$A:$P,15,0),0)","v":0},{"$f":"IF(AND(AV$3<>\"\", VLOOKUP(AV$2,'Technische Daten'!$A:$P,9,0) <> 0,VLOOKUP(AV$2,'Technische Daten'!$A:$AA,27,0) = 1),AV$3*VLOOKUP(AV$2,'Technische Daten'!$A:$P,15,0),0)","v":0},null,{"$f":"IF(AND(AX$3<>\"\", VLOOKUP(AX$2,'Technische Daten'!$A:$P,9,0) <> 0,VLOOKUP(AX$2,'Technische Daten'!$A:$AA,27,0) = 1),AX$3*VLOOKUP(AX$2,'Technische Daten'!$A:$P,15,0),0)","v":0}]
["Summe DO RX",0,{"$f":"IF(AND(C$3<>\"\", VLOOKUP(C$2,'Technische Daten'!$A:$P,10,0) <> 0,VLOOKUP(C$2,'Technische Daten'!$A:$AA,27,0) = 1),C$3*VLOOKUP(C$2,'Technische Daten'!$A:$P,16,0),0)","v":0},{"$f":"IF(AND(D$3<>\"\", VLOOKUP(D$2,'Technische Daten'!$A:$P,10,0) <> 0,VLOOKUP(D$2,'Technische Daten'!$A:$AA,27,0) = 1),D$3*VLOOKUP(D$2,'Technische Daten'!$A:$P,16,0),0)","v":0},{"$f":"IF(AND(E$3<>\"\", VLOOKUP(E$2,'Technische Daten'!$A:$P,10,0) <> 0,VLOOKUP(E$2,'Technische Daten'!$A:$AA,27,0) = 1),E$3*VLOOKUP(E$2,'Technische Daten'!$A:$P,16,0),0)","v":0},{"$f":"IF(AND(F$3<>\"\", VLOOKUP(F$2,'Technische Daten'!$A:$P,10,0) <> 0,VLOOKUP(F$2,'Technische Daten'!$A:$AA,27,0) = 1),F$3*VLOOKUP(F$2,'Technische Daten'!$A:$P,16,0),0)","v":0},{"$f":"IF(AND(G$3<>\"\", VLOOKUP(G$2,'Technische Daten'!$A:$P,10,0) <> 0,VLOOKUP(G$2,'Technische Daten'!$A:$AA,27,0) = 1),G$3*VLOOKUP(G$2,'Technische Daten'!$A:$P,16,0),0)","v":0},{"$f":"IF(AND(H$3<>\"\", VLOOKUP(H$2,'Technische Daten'!$A:$P,10,0) <> 0,VLOOKUP(H$2,'Technische Daten'!$A:$AA,27,0) = 1),H$3*VLOOKUP(H$2,'Technische Daten'!$A:$P,16,0),0)","v":0},{"$f":"IF(AND(I$3<>\"\", VLOOKUP(I$2,'Technische Daten'!$A:$P,10,0) <> 0,VLOOKUP(I$2,'Technische Daten'!$A:$AA,27,0) = 1),I$3*VLOOKUP(I$2,'Technische Daten'!$A:$P,16,0),0)","v":0},{"$f":"IF(AND(J$3<>\"\", VLOOKUP(J$2,'Technische Daten'!$A:$P,10,0) <> 0,VLOOKUP(J$2,'Technische Daten'!$A:$AA,27,0) = 1),J$3*VLOOKUP(J$2,'Technische Daten'!$A:$P,16,0),0)","v":0},{"$f":"IF(AND(K$3<>\"\", VLOOKUP(K$2,'Technische Daten'!$A:$P,10,0) <> 0,VLOOKUP(K$2,'Technische Daten'!$A:$AA,27,0) = 1),K$3*VLOOKUP(K$2,'Technische Daten'!$A:$P,16,0),0)","v":0},{"$f":"IF(AND(L$3<>\"\", VLOOKUP(L$2,'Technische Daten'!$A:$P,10,0) <> 0,VLOOKUP(L$2,'Technische Daten'!$A:$AA,27,0) = 1),L$3*VLOOKUP(L$2,'Technische Daten'!$A:$P,16,0),0)","v":0},{"$f":"IF(AND(M$3<>\"\", VLOOKUP(M$2,'Technische Daten'!$A:$P,10,0) <> 0,VLOOKUP(M$2,'Technische Daten'!$A:$AA,27,0) = 1),M$3*VLOOKUP(M$2,'Technische Daten'!$A:$P,16,0),0)","v":0},{"$f":"IF(AND(N$3<>\"\", VLOOKUP(N$2,'Technische Daten'!$A:$P,10,0) <> 0,VLOOKUP(N$2,'Technische Daten'!$A:$AA,27,0) = 1),N$3*VLOOKUP(N$2,'Technische Daten'!$A:$P,16,0),0)","v":0},{"$f":"IF(AND(O$3<>\"\", VLOOKUP(O$2,'Technische Daten'!$A:$P,10,0) <> 0,VLOOKUP(O$2,'Technische Daten'!$A:$AA,27,0) = 1),O$3*VLOOKUP(O$2,'Technische Daten'!$A:$P,16,0),0)","v":0},{"$f":"IF(AND(P$3<>\"\", VLOOKUP(P$2,'Technische Daten'!$A:$P,10,0) <> 0,VLOOKUP(P$2,'Technische Daten'!$A:$AA,27,0) = 1),P$3*VLOOKUP(P$2,'Technische Daten'!$A:$P,16,0),0)","v":0},{"$f":"IF(AND(Q$3<>\"\", VLOOKUP(Q$2,'Technische Daten'!$A:$P,10,0) <> 0,VLOOKUP(Q$2,'Technische Daten'!$A:$AA,27,0) = 1),Q$3*VLOOKUP(Q$2,'Technische Daten'!$A:$P,16,0),0)","v":0},{"$f":"IF(AND(R$3<>\"\", VLOOKUP(R$2,'Technische Daten'!$A:$P,10,0) <> 0,VLOOKUP(R$2,'Technische Daten'!$A:$AA,27,0) = 1),R$3*VLOOKUP(R$2,'Technische Daten'!$A:$P,16,0),0)","v":0},{"$f":"IF(AND(S$3<>\"\", VLOOKUP(S$2,'Technische Daten'!$A:$P,10,0) <> 0,VLOOKUP(S$2,'Technische Daten'!$A:$AA,27,0) = 1),S$3*VLOOKUP(S$2,'Technische Daten'!$A:$P,16,0),0)","v":0},{"$f":"IF(AND(T$3<>\"\", VLOOKUP(T$2,'Technische Daten'!$A:$P,10,0) <> 0,VLOOKUP(T$2,'Technische Daten'!$A:$AA,27,0) = 1),T$3*VLOOKUP(T$2,'Technische Daten'!$A:$P,16,0),0)","v":0},{"$f":"IF(AND(U$3<>\"\", VLOOKUP(U$2,'Technische Daten'!$A:$P,10,0) <> 0,VLOOKUP(U$2,'Technische Daten'!$A:$AA,27,0) = 1),U$3*VLOOKUP(U$2,'Technische Daten'!$A:$P,16,0),0)","v":0},{"$f":"IF(AND(V$3<>\"\", VLOOKUP(V$2,'Technische Daten'!$A:$P,10,0) <> 0,VLOOKUP(V$2,'Technische Daten'!$A:$AA,27,0) = 1),V$3*VLOOKUP(V$2,'Technische Daten'!$A:$P,16,0),0)","v":0},{"$f":"IF(AND(W$3<>\"\", VLOOKUP(W$2,'Technische Daten'!$A:$P,10,0) <> 0,VLOOKUP(W$2,'Technische Daten'!$A:$AA,27,0) = 1),W$3*VLOOKUP(W$2,'Technische Daten'!$A:$P,16,0),0)","v":0},{"$f":"IF(AND(X$3<>\"\", VLOOKUP(X$2,'Technische Daten'!$A:$P,10,0) <> 0,VLOOKUP(X$2,'Technische Daten'!$A:$AA,27,0) = 1),X$3*VLOOKUP(X$2,'Technische Daten'!$A:$P,16,0),0)","v":0},{"$f":"IF(AND(Y$3<>\"\", VLOOKUP(Y$2,'Technische Daten'!$A:$P,10,0) <> 0,VLOOKUP(Y$2,'Technische Daten'!$A:$AA,27,0) = 1),Y$3*VLOOKUP(Y$2,'Technische Daten'!$A:$P,16,0),0)","v":0},{"$f":"IF(AND(Z$3<>\"\", VLOOKUP(Z$2,'Technische Daten'!$A:$P,10,0) <> 0,VLOOKUP(Z$2,'Technische Daten'!$A:$AA,27,0) = 1),Z$3*VLOOKUP(Z$2,'Technische Daten'!$A:$P,16,0),0)","v":0},{"$f":"IF(AND(AA$3<>\"\", VLOOKUP(AA$2,'Technische Daten'!$A:$P,10,0) <> 0,VLOOKUP(AA$2,'Technische Daten'!$A:$AA,27,0) = 1),AA$3*VLOOKUP(AA$2,'Technische Daten'!$A:$P,16,0),0)","v":0},{"$f":"IF(AND(AB$3<>\"\", VLOOKUP(AB$2,'Technische Daten'!$A:$P,10,0) <> 0,VLOOKUP(AB$2,'Technische Daten'!$A:$AA,27,0) = 1),AB$3*VLOOKUP(AB$2,'Technische Daten'!$A:$P,16,0),0)","v":0},{"$f":"IF(AND(AC$3<>\"\", VLOOKUP(AC$2,'Technische Daten'!$A:$P,10,0) <> 0,VLOOKUP(AC$2,'Technische Daten'!$A:$AA,27,0) = 1),AC$3*VLOOKUP(AC$2,'Technische Daten'!$A:$P,16,0),0)","v":0},{"$f":"IF(AND(AD$3<>\"\", VLOOKUP(AD$2,'Technische Daten'!$A:$P,10,0) <> 0,VLOOKUP(AD$2,'Technische Daten'!$A:$AA,27,0) = 1),AD$3*VLOOKUP(AD$2,'Technische Daten'!$A:$P,16,0),0)","v":0},{"$f":"IF(AND(AE$3<>\"\", VLOOKUP(AE$2,'Technische Daten'!$A:$P,10,0) <> 0,VLOOKUP(AE$2,'Technische Daten'!$A:$AA,27,0) = 1),AE$3*VLOOKUP(AE$2,'Technische Daten'!$A:$P,16,0),0)","v":0},{"$f":"IF(AND(AF$3<>\"\", VLOOKUP(AF$2,'Technische Daten'!$A:$P,10,0) <> 0,VLOOKUP(AF$2,'Technische Daten'!$A:$AA,27,0) = 1),AF$3*VLOOKUP(AF$2,'Technische Daten'!$A:$P,16,0),0)","v":0},{"$f":"IF(AND(AG$3<>\"\", VLOOKUP(AG$2,'Technische Daten'!$A:$P,10,0) <> 0,VLOOKUP(AG$2,'Technische Daten'!$A:$AA,27,0) = 1),AG$3*VLOOKUP(AG$2,'Technische Daten'!$A:$P,16,0),0)","v":0},{"$f":"IF(AND(AH$3<>\"\", VLOOKUP(AH$2,'Technische Daten'!$A:$P,10,0) <> 0,VLOOKUP(AH$2,'Technische Daten'!$A:$AA,27,0) = 1),AH$3*VLOOKUP(AH$2,'Technische Daten'!$A:$P,16,0),0)","v":0},{"$f":"IF(AND(AI$3<>\"\", VLOOKUP(AI$2,'Technische Daten'!$A:$P,10,0) <> 0,VLOOKUP(AI$2,'Technische Daten'!$A:$AA,27,0) = 1),AI$3*VLOOKUP(AI$2,'Technische Daten'!$A:$P,16,0),0)","v":0},{"$f":"IF(AND(AJ$3<>\"\", VLOOKUP(AJ$2,'Technische Daten'!$A:$P,10,0) <> 0,VLOOKUP(AJ$2,'Technische Daten'!$A:$AA,27,0) = 1),AJ$3*VLOOKUP(AJ$2,'Technische Daten'!$A:$P,16,0),0)","v":0},{"$f":"IF(AND(AK$3<>\"\", VLOOKUP(AK$2,'Technische Daten'!$A:$P,10,0) <> 0,VLOOKUP(AK$2,'Technische Daten'!$A:$AA,27,0) = 1),AK$3*VLOOKUP(AK$2,'Technische Daten'!$A:$P,16,0),0)","v":0},{"$f":"IF(AND(AL$3<>\"\", VLOOKUP(AL$2,'Technische Daten'!$A:$P,10,0) <> 0,VLOOKUP(AL$2,'Technische Daten'!$A:$AA,27,0) = 1),AL$3*VLOOKUP(AL$2,'Technische Daten'!$A:$P,16,0),0)","v":0},{"$f":"IF(AND(AM$3<>\"\", VLOOKUP(AM$2,'Technische Daten'!$A:$P,10,0) <> 0,VLOOKUP(AM$2,'Technische Daten'!$A:$AA,27,0) = 1),AM$3*VLOOKUP(AM$2,'Technische Daten'!$A:$P,16,0),0)","v":0},{"$f":"IF(AND(AN$3<>\"\", VLOOKUP(AN$2,'Technische Daten'!$A:$P,10,0) <> 0,VLOOKUP(AN$2,'Technische Daten'!$A:$AA,27,0) = 1),AN$3*VLOOKUP(AN$2,'Technische Daten'!$A:$P,16,0),0)","v":0},{"$f":"IF(AND(AO$3<>\"\", VLOOKUP(AO$2,'Technische Daten'!$A:$P,10,0) <> 0,VLOOKUP(AO$2,'Technische Daten'!$A:$AA,27,0) = 1),AO$3*VLOOKUP(AO$2,'Technische Daten'!$A:$P,16,0),0)","v":0},{"$f":"IF(AND(AP$3<>\"\", VLOOKUP(AP$2,'Technische Daten'!$A:$P,10,0) <> 0,VLOOKUP(AP$2,'Technische Daten'!$A:$AA,27,0) = 1),AP$3*VLOOKUP(AP$2,'Technische Daten'!$A:$P,16,0),0)","v":0},{"$f":"IF(AND(AQ$3<>\"\", VLOOKUP(AQ$2,'Technische Daten'!$A:$P,10,0) <> 0,VLOOKUP(AQ$2,'Technische Daten'!$A:$AA,27,0) = 1),AQ$3*VLOOKUP(AQ$2,'Technische Daten'!$A:$P,16,0),0)","v":0},{"$f":"IF(AND(AR$3<>\"\", VLOOKUP(AR$2,'Technische Daten'!$A:$P,10,0) <> 0,VLOOKUP(AR$2,'Technische Daten'!$A:$AA,27,0) = 1),AR$3*VLOOKUP(AR$2,'Technische Daten'!$A:$P,16,0),0)","v":0},{"$f":"IF(AND(AS$3<>\"\", VLOOKUP(AS$2,'Technische Daten'!$A:$P,10,0) <> 0,VLOOKUP(AS$2,'Technische Daten'!$A:$AA,27,0) = 1),AS$3*VLOOKUP(AS$2,'Technische Daten'!$A:$P,16,0),0)","v":0},{"$f":"IF(AND(AT$3<>\"\", VLOOKUP(AT$2,'Technische Daten'!$A:$P,10,0) <> 0,VLOOKUP(AT$2,'Technische Daten'!$A:$AA,27,0) = 1),AT$3*VLOOKUP(AT$2,'Technische Daten'!$A:$P,16,0),0)","v":0},{"$f":"IF(AND(AU$3<>\"\", VLOOKUP(AU$2,'Technische Daten'!$A:$P,10,0) <> 0,VLOOKUP(AU$2,'Technische Daten'!$A:$AA,27,0) = 1),AU$3*VLOOKUP(AU$2,'Technische Daten'!$A:$P,16,0),0)","v":0},{"$f":"IF(AND(AV$3<>\"\", VLOOKUP(AV$2,'Technische Daten'!$A:$P,10,0) <> 0,VLOOKUP(AV$2,'Technische Daten'!$A:$AA,27,0) = 1),AV$3*VLOOKUP(AV$2,'Technische Daten'!$A:$P,16,0),0)","v":0},null,{"$f":"IF(AND(AX$3<>\"\", VLOOKUP(AX$2,'Technische Daten'!$A:$P,10,0) <> 0,VLOOKUP(AX$2,'Technische Daten'!$A:$AA,27,0) = 1),AX$3*VLOOKUP(AX$2,'Technische Daten'!$A:$P,16,0),0)","v":0}]
["Summe AI TX",0,{"$f":"IF(AND(C$3<>\"\", VLOOKUP(C$2,'Technische Daten'!$A:$P,11,0) <> 0,VLOOKUP(C$2,'Technische Daten'!$A:$AA,27,0) = 1),C$3*VLOOKUP(C$2,'Technische Daten'!$A:$P,15,0),0)","v":0},{"$f":"IF(AND(D$3<>\"\", VLOOKUP(D$2,'Technische Daten'!$A:$P,11,0) <> 0,VLOOKUP(D$2,'Technische Daten'!$A:$AA,27,0) = 1),D$3*VLOOKUP(D$2,'Technische Daten'!$A:$P,15,0),0)","v":0},{"$f":"IF(AND(E$3<>\"\", VLOOKUP(E$2,'Technische Daten'!$A:$P,11,0) <> 0,VLOOKUP(E$2,'Technische Daten'!$A:$AA,27,0) = 1),E$3*VLOOKUP(E$2,'Technische Daten'!$A:$P,15,0),0)","v":0},{"$f":"IF(AND(F$3<>\"\", VLOOKUP(F$2,'Technische Daten'!$A:$P,11,0) <> 0,VLOOKUP(F$2,'Technische Daten'!$A:$AA,27,0) = 1),F$3*VLOOKUP(F$2,'Technische Daten'!$A:$P,15,0),0)","v":0},{"$f":"IF(AND(G$3<>\"\", VLOOKUP(G$2,'Technische Daten'!$A:$P,11,0) <> 0,VLOOKUP(G$2,'Technische Daten'!$A:$AA,27,0) = 1),G$3*VLOOKUP(G$2,'Technische Daten'!$A:$P,15,0),0)","v":0},{"$f":"IF(AND(H$3<>\"\", VLOOKUP(H$2,'Technische Daten'!$A:$P,11,0) <> 0,VLOOKUP(H$2,'Technische Daten'!$A:$AA,27,0) = 1),H$3*VLOOKUP(H$2,'Technische Daten'!$A:$P,15,0),0)","v":0},{"$f":"IF(AND(I$3<>\"\", VLOOKUP(I$2,'Technische Daten'!$A:$P,11,0) <> 0,VLOOKUP(I$2,'Technische Daten'!$A:$AA,27,0) = 1),I$3*VLOOKUP(I$2,'Technische Daten'!$A:$P,15,0),0)","v":0},{"$f":"IF(AND(J$3<>\"\", VLOOKUP(J$2,'Technische Daten'!$A:$P,11,0) <> 0,VLOOKUP(J$2,'Technische Daten'!$A:$AA,27,0) = 1),J$3*VLOOKUP(J$2,'Technische Daten'!$A:$P,15,0),0)","v":0},{"$f":"IF(AND(K$3<>\"\", VLOOKUP(K$2,'Technische Daten'!$A:$P,11,0) <> 0,VLOOKUP(K$2,'Technische Daten'!$A:$AA,27,0) = 1),K$3*VLOOKUP(K$2,'Technische Daten'!$A:$P,15,0),0)","v":0},{"$f":"IF(AND(L$3<>\"\", VLOOKUP(L$2,'Technische Daten'!$A:$P,11,0) <> 0,VLOOKUP(L$2,'Technische Daten'!$A:$AA,27,0) = 1),L$3*VLOOKUP(L$2,'Technische Daten'!$A:$P,15,0),0)","v":0},{"$f":"IF(AND(M$3<>\"\", VLOOKUP(M$2,'Technische Daten'!$A:$P,11,0) <> 0,VLOOKUP(M$2,'Technische Daten'!$A:$AA,27,0) = 1),M$3*VLOOKUP(M$2,'Technische Daten'!$A:$P,15,0),0)","v":0},{"$f":"IF(AND(N$3<>\"\", VLOOKUP(N$2,'Technische Daten'!$A:$P,11,0) <> 0,VLOOKUP(N$2,'Technische Daten'!$A:$AA,27,0) = 1),N$3*VLOOKUP(N$2,'Technische Daten'!$A:$P,15,0),0)","v":0},{"$f":"IF(AND(O$3<>\"\", VLOOKUP(O$2,'Technische Daten'!$A:$P,11,0) <> 0,VLOOKUP(O$2,'Technische Daten'!$A:$AA,27,0) = 1),O$3*VLOOKUP(O$2,'Technische Daten'!$A:$P,15,0),0)","v":0},{"$f":"IF(AND(P$3<>\"\", VLOOKUP(P$2,'Technische Daten'!$A:$P,11,0) <> 0,VLOOKUP(P$2,'Technische Daten'!$A:$AA,27,0) = 1),P$3*VLOOKUP(P$2,'Technische Daten'!$A:$P,15,0),0)","v":0},{"$f":"IF(AND(Q$3<>\"\", VLOOKUP(Q$2,'Technische Daten'!$A:$P,11,0) <> 0,VLOOKUP(Q$2,'Technische Daten'!$A:$AA,27,0) = 1),Q$3*VLOOKUP(Q$2,'Technische Daten'!$A:$P,15,0),0)","v":0},{"$f":"IF(AND(R$3<>\"\", VLOOKUP(R$2,'Technische Daten'!$A:$P,11,0) <> 0,VLOOKUP(R$2,'Technische Daten'!$A:$AA,27,0) = 1),R$3*VLOOKUP(R$2,'Technische Daten'!$A:$P,15,0),0)","v":0},{"$f":"IF(AND(S$3<>\"\", VLOOKUP(S$2,'Technische Daten'!$A:$P,11,0) <> 0,VLOOKUP(S$2,'Technische Daten'!$A:$AA,27,0) = 1),S$3*VLOOKUP(S$2,'Technische Daten'!$A:$P,15,0),0)","v":0},{"$f":"IF(AND(T$3<>\"\", VLOOKUP(T$2,'Technische Daten'!$A:$P,11,0) <> 0,VLOOKUP(T$2,'Technische Daten'!$A:$AA,27,0) = 1),T$3*VLOOKUP(T$2,'Technische Daten'!$A:$P,15,0),0)","v":0},{"$f":"IF(AND(U$3<>\"\", VLOOKUP(U$2,'Technische Daten'!$A:$P,11,0) <> 0,VLOOKUP(U$2,'Technische Daten'!$A:$AA,27,0) = 1),U$3*VLOOKUP(U$2,'Technische Daten'!$A:$P,15,0),0)","v":0},{"$f":"IF(AND(V$3<>\"\", VLOOKUP(V$2,'Technische Daten'!$A:$P,11,0) <> 0,VLOOKUP(V$2,'Technische Daten'!$A:$AA,27,0) = 1),V$3*VLOOKUP(V$2,'Technische Daten'!$A:$P,15,0),0)","v":0},{"$f":"IF(AND(W$3<>\"\", VLOOKUP(W$2,'Technische Daten'!$A:$P,11,0) <> 0,VLOOKUP(W$2,'Technische Daten'!$A:$AA,27,0) = 1),W$3*VLOOKUP(W$2,'Technische Daten'!$A:$P,15,0),0)","v":0},{"$f":"IF(AND(X$3<>\"\", VLOOKUP(X$2,'Technische Daten'!$A:$P,11,0) <> 0,VLOOKUP(X$2,'Technische Daten'!$A:$AA,27,0) = 1),X$3*VLOOKUP(X$2,'Technische Daten'!$A:$P,15,0),0)","v":0},{"$f":"IF(AND(Y$3<>\"\", VLOOKUP(Y$2,'Technische Daten'!$A:$P,11,0) <> 0,VLOOKUP(Y$2,'Technische Daten'!$A:$AA,27,0) = 1),Y$3*VLOOKUP(Y$2,'Technische Daten'!$A:$P,15,0),0)","v":0},{"$f":"IF(AND(Z$3<>\"\", VLOOKUP(Z$2,'Technische Daten'!$A:$P,11,0) <> 0,VLOOKUP(Z$2,'Technische Daten'!$A:$AA,27,0) = 1),Z$3*VLOOKUP(Z$2,'Technische Daten'!$A:$P,15,0),0)","v":0},{"$f":"IF(AND(AA$3<>\"\", VLOOKUP(AA$2,'Technische Daten'!$A:$P,11,0) <> 0,VLOOKUP(AA$2,'Technische Daten'!$A:$AA,27,0) = 1),AA$3*VLOOKUP(AA$2,'Technische Daten'!$A:$P,15,0),0)","v":0},{"$f":"IF(AND(AB$3<>\"\", VLOOKUP(AB$2,'Technische Daten'!$A:$P,11,0) <> 0,VLOOKUP(AB$2,'Technische Daten'!$A:$AA,27,0) = 1),AB$3*VLOOKUP(AB$2,'Technische Daten'!$A:$P,15,0),0)","v":0},{"$f":"IF(AND(AC$3<>\"\", VLOOKUP(AC$2,'Technische Daten'!$A:$P,11,0) <> 0,VLOOKUP(AC$2,'Technische Daten'!$A:$AA,27,0) = 1),AC$3*VLOOKUP(AC$2,'Technische Daten'!$A:$P,15,0),0)","v":0},{"$f":"IF(AND(AD$3<>\"\", VLOOKUP(AD$2,'Technische Daten'!$A:$P,11,0) <> 0,VLOOKUP(AD$2,'Technische Daten'!$A:$AA,27,0) = 1),AD$3*VLOOKUP(AD$2,'Technische Daten'!$A:$P,15,0),0)","v":0},{"$f":"IF(AND(AE$3<>\"\", VLOOKUP(AE$2,'Technische Daten'!$A:$P,11,0) <> 0,VLOOKUP(AE$2,'Technische Daten'!$A:$AA,27,0) = 1),AE$3*VLOOKUP(AE$2,'Technische Daten'!$A:$P,15,0),0)","v":0},{"$f":"IF(AND(AF$3<>\"\", VLOOKUP(AF$2,'Technische Daten'!$A:$P,11,0) <> 0,VLOOKUP(AF$2,'Technische Daten'!$A:$AA,27,0) = 1),AF$3*VLOOKUP(AF$2,'Technische Daten'!$A:$P,15,0),0)","v":0},{"$f":"IF(AND(AG$3<>\"\", VLOOKUP(AG$2,'Technische Daten'!$A:$P,11,0) <> 0,VLOOKUP(AG$2,'Technische Daten'!$A:$AA,27,0) = 1),AG$3*VLOOKUP(AG$2,'Technische Daten'!$A:$P,15,0),0)","v":0},{"$f":"IF(AND(AH$3<>\"\", VLOOKUP(AH$2,'Technische Daten'!$A:$P,11,0) <> 0,VLOOKUP(AH$2,'Technische Daten'!$A:$AA,27,0) = 1),AH$3*VLOOKUP(AH$2,'Technische Daten'!$A:$P,15,0),0)","v":0},{"$f":"IF(AND(AI$3<>\"\", VLOOKUP(AI$2,'Technische Daten'!$A:$P,11,0) <> 0,VLOOKUP(AI$2,'Technische Daten'!$A:$AA,27,0) = 1),AI$3*VLOOKUP(AI$2,'Technische Daten'!$A:$P,15,0),0)","v":0},{"$f":"IF(AND(AJ$3<>\"\", VLOOKUP(AJ$2,'Technische Daten'!$A:$P,11,0) <> 0,VLOOKUP(AJ$2,'Technische Daten'!$A:$AA,27,0) = 1),AJ$3*VLOOKUP(AJ$2,'Technische Daten'!$A:$P,15,0),0)","v":0},{"$f":"IF(AND(AK$3<>\"\", VLOOKUP(AK$2,'Technische Daten'!$A:$P,11,0) <> 0,VLOOKUP(AK$2,'Technische Daten'!$A:$AA,27,0) = 1),AK$3*VLOOKUP(AK$2,'Technische Daten'!$A:$P,15,0),0)","v":0},{"$f":"IF(AND(AL$3<>\"\", VLOOKUP(AL$2,'Technische Daten'!$A:$P,11,0) <> 0,VLOOKUP(AL$2,'Technische Daten'!$A:$AA,27,0) = 1),AL$3*VLOOKUP(AL$2,'Technische Daten'!$A:$P,15,0),0)","v":0},{"$f":"IF(AND(AM$3<>\"\", VLOOKUP(AM$2,'Technische Daten'!$A:$P,11,0) <> 0,VLOOKUP(AM$2,'Technische Daten'!$A:$AA,27,0) = 1),AM$3*VLOOKUP(AM$2,'Technische Daten'!$A:$P,15,0),0)","v":0},{"$f":"IF(AND(AN$3<>\"\", VLOOKUP(AN$2,'Technische Daten'!$A:$P,11,0) <> 0,VLOOKUP(AN$2,'Technische Daten'!$A:$AA,27,0) = 1),AN$3*VLOOKUP(AN$2,'Technische Daten'!$A:$P,15,0),0)","v":0},{"$f":"IF(AND(AO$3<>\"\", VLOOKUP(AO$2,'Technische Daten'!$A:$P,11,0) <> 0,VLOOKUP(AO$2,'Technische Daten'!$A:$AA,27,0) = 1),AO$3*VLOOKUP(AO$2,'Technische Daten'!$A:$P,15,0),0)","v":0},{"$f":"IF(AND(AP$3<>\"\", VLOOKUP(AP$2,'Technische Daten'!$A:$P,11,0) <> 0,VLOOKUP(AP$2,'Technische Daten'!$A:$AA,27,0) = 1),AP$3*VLOOKUP(AP$2,'Technische Daten'!$A:$P,15,0),0)","v":0},{"$f":"IF(AND(AQ$3<>\"\", VLOOKUP(AQ$2,'Technische Daten'!$A:$P,11,0) <> 0,VLOOKUP(AQ$2,'Technische Daten'!$A:$AA,27,0) = 1),AQ$3*VLOOKUP(AQ$2,'Technische Daten'!$A:$P,15,0),0)","v":0},{"$f":"IF(AND(AR$3<>\"\", VLOOKUP(AR$2,'Technische Daten'!$A:$P,11,0) <> 0,VLOOKUP(AR$2,'Technische Daten'!$A:$AA,27,0) = 1),AR$3*VLOOKUP(AR$2,'Technische Daten'!$A:$P,15,0),0)","v":0},{"$f":"IF(AND(AS$3<>\"\", VLOOKUP(AS$2,'Technische Daten'!$A:$P,11,0) <> 0,VLOOKUP(AS$2,'Technische Daten'!$A:$AA,27,0) = 1),AS$3*VLOOKUP(AS$2,'Technische Daten'!$A:$P,15,0),0)","v":0},{"$f":"IF(AND(AT$3<>\"\", VLOOKUP(AT$2,'Technische Daten'!$A:$P,11,0) <> 0,VLOOKUP(AT$2,'Technische Daten'!$A:$AA,27,0) = 1),AT$3*VLOOKUP(AT$2,'Technische Daten'!$A:$P,15,0),0)","v":0},{"$f":"IF(AND(AU$3<>\"\", VLOOKUP(AU$2,'Technische Daten'!$A:$P,11,0) <> 0,VLOOKUP(AU$2,'Technische Daten'!$A:$AA,27,0) = 1),AU$3*VLOOKUP(AU$2,'Technische Daten'!$A:$P,15,0),0)","v":0},{"$f":"IF(AND(AV$3<>\"\", VLOOKUP(AV$2,'Technische Daten'!$A:$P,11,0) <> 0,VLOOKUP(AV$2,'Technische Daten'!$A:$AA,27,0) = 1),AV$3*VLOOKUP(AV$2,'Technische Daten'!$A:$P,15,0),0)","v":0},null,{"$f":"IF(AND(AX$3<>\"\", VLOOKUP(AX$2,'Technische Daten'!$A:$P,11,0) <> 0,VLOOKUP(AX$2,'Technische Daten'!$A:$AA,27,0) = 1),AX$3*VLOOKUP(AX$2,'Technische Daten'!$A:$P,15,0),0)","v":0}]
["Summe AO RX",0,{"$f":"IF(AND(C$3<>\"\", VLOOKUP(C$2,'Technische Daten'!$A:$P,12,0) <> 0,VLOOKUP(C$2,'Technische Daten'!$A:$AA,27,0) = 1),C$3*VLOOKUP(C$2,'Technische Daten'!$A:$P,16,0),0)","v":0},{"$f":"IF(AND(D$3<>\"\", VLOOKUP(D$2,'Technische Daten'!$A:$P,12,0) <> 0,VLOOKUP(D$2,'Technische Daten'!$A:$AA,27,0) = 1),D$3*VLOOKUP(D$2,'Technische Daten'!$A:$P,16,0),0)","v":0},{"$f":"IF(AND(E$3<>\"\", VLOOKUP(E$2,'Technische Daten'!$A:$P,12,0) <> 0,VLOOKUP(E$2,'Technische Daten'!$A:$AA,27,0) = 1),E$3*VLOOKUP(E$2,'Technische Daten'!$A:$P,16,0),0)","v":0},{"$f":"IF(AND(F$3<>\"\", VLOOKUP(F$2,'Technische Daten'!$A:$P,12,0) <> 0,VLOOKUP(F$2,'Technische Daten'!$A:$AA,27,0) = 1),F$3*VLOOKUP(F$2,'Technische Daten'!$A:$P,16,0),0)","v":0},{"$f":"IF(AND(G$3<>\"\", VLOOKUP(G$2,'Technische Daten'!$A:$P,12,0) <> 0,VLOOKUP(G$2,'Technische Daten'!$A:$AA,27,0) = 1),G$3*VLOOKUP(G$2,'Technische Daten'!$A:$P,16,0),0)","v":0},{"$f":"IF(AND(H$3<>\"\", VLOOKUP(H$2,'Technische Daten'!$A:$P,12,0) <> 0,VLOOKUP(H$2,'Technische Daten'!$A:$AA,27,0) = 1),H$3*VLOOKUP(H$2,'Technische Daten'!$A:$P,16,0),0)","v":0},{"$f":"IF(AND(I$3<>\"\", VLOOKUP(I$2,'Technische Daten'!$A:$P,12,0) <> 0,VLOOKUP(I$2,'Technische Daten'!$A:$AA,27,0) = 1),I$3*VLOOKUP(I$2,'Technische Daten'!$A:$P,16,0),0)","v":0},{"$f":"IF(AND(J$3<>\"\", VLOOKUP(J$2,'Technische Daten'!$A:$P,12,0) <> 0,VLOOKUP(J$2,'Technische Daten'!$A:$AA,27,0) = 1),J$3*VLOOKUP(J$2,'Technische Daten'!$A:$P,16,0),0)","v":0},{"$f":"IF(AND(K$3<>\"\", VLOOKUP(K$2,'Technische Daten'!$A:$P,12,0) <> 0,VLOOKUP(K$2,'Technische Daten'!$A:$AA,27,0) = 1),K$3*VLOOKUP(K$2,'Technische Daten'!$A:$P,16,0),0)","v":0},{"$f":"IF(AND(L$3<>\"\", VLOOKUP(L$2,'Technische Daten'!$A:$P,12,0) <> 0,VLOOKUP(L$2,'Technische Daten'!$A:$AA,27,0) = 1),L$3*VLOOKUP(L$2,'Technische Daten'!$A:$P,16,0),0)","v":0},{"$f":"IF(AND(M$3<>\"\", VLOOKUP(M$2,'Technische Daten'!$A:$P,12,0) <> 0,VLOOKUP(M$2,'Technische Daten'!$A:$AA,27,0) = 1),M$3*VLOOKUP(M$2,'Technische Daten'!$A:$P,16,0),0)","v":0},{"$f":"IF(AND(N$3<>\"\", VLOOKUP(N$2,'Technische Daten'!$A:$P,12,0) <> 0,VLOOKUP(N$2,'Technische Daten'!$A:$AA,27,0) = 1),N$3*VLOOKUP(N$2,'Technische Daten'!$A:$P,16,0),0)","v":0},{"$f":"IF(AND(O$3<>\"\", VLOOKUP(O$2,'Technische Daten'!$A:$P,12,0) <> 0,VLOOKUP(O$2,'Technische Daten'!$A:$AA,27,0) = 1),O$3*VLOOKUP(O$2,'Technische Daten'!$A:$P,16,0),0)","v":0},{"$f":"IF(AND(P$3<>\"\", VLOOKUP(P$2,'Technische Daten'!$A:$P,12,0) <> 0,VLOOKUP(P$2,'Technische Daten'!$A:$AA,27,0) = 1),P$3*VLOOKUP(P$2,'Technische Daten'!$A:$P,16,0),0)","v":0},{"$f":"IF(AND(Q$3<>\"\", VLOOKUP(Q$2,'Technische Daten'!$A:$P,12,0) <> 0,VLOOKUP(Q$2,'Technische Daten'!$A:$AA,27,0) = 1),Q$3*VLOOKUP(Q$2,'Technische Daten'!$A:$P,16,0),0)","v":0},{"$f":"IF(AND(R$3<>\"\", VLOOKUP(R$2,'Technische Daten'!$A:$P,12,0) <> 0,VLOOKUP(R$2,'Technische Daten'!$A:$AA,27,0) = 1),R$3*VLOOKUP(R$2,'Technische Daten'!$A:$P,16,0),0)","v":0},{"$f":"IF(AND(S$3<>\"\", VLOOKUP(S$2,'Technische Daten'!$A:$P,12,0) <> 0,VLOOKUP(S$2,'Technische Daten'!$A:$AA,27,0) = 1),S$3*VLOOKUP(S$2,'Technische Daten'!$A:$P,16,0),0)","v":0},{"$f":"IF(AND(T$3<>\"\", VLOOKUP(T$2,'Technische Daten'!$A:$P,12,0) <> 0,VLOOKUP(T$2,'Technische Daten'!$A:$AA,27,0) = 1),T$3*VLOOKUP(T$2,'Technische Daten'!$A:$P,16,0),0)","v":0},{"$f":"IF(AND(U$3<>\"\", VLOOKUP(U$2,'Technische Daten'!$A:$P,12,0) <> 0,VLOOKUP(U$2,'Technische Daten'!$A:$AA,27,0) = 1),U$3*VLOOKUP(U$2,'Technische Daten'!$A:$P,16,0),0)","v":0},{"$f":"IF(AND(V$3<>\"\", VLOOKUP(V$2,'Technische Daten'!$A:$P,12,0) <> 0,VLOOKUP(V$2,'Technische Daten'!$A:$AA,27,0) = 1),V$3*VLOOKUP(V$2,'Technische Daten'!$A:$P,16,0),0)","v":0},{"$f":"IF(AND(W$3<>\"\", VLOOKUP(W$2,'Technische Daten'!$A:$P,12,0) <> 0,VLOOKUP(W$2,'Technische Daten'!$A:$AA,27,0) = 1),W$3*VLOOKUP(W$2,'Technische Daten'!$A:$P,16,0),0)","v":0},{"$f":"IF(AND(X$3<>\"\", VLOOKUP(X$2,'Technische Daten'!$A:$P,12,0) <> 0,VLOOKUP(X$2,'Technische Daten'!$A:$AA,27,0) = 1),X$3*VLOOKUP(X$2,'Technische Daten'!$A:$P,16,0),0)","v":0},{"$f":"IF(AND(Y$3<>\"\", VLOOKUP(Y$2,'Technische Daten'!$A:$P,12,0) <> 0,VLOOKUP(Y$2,'Technische Daten'!$A:$AA,27,0) = 1),Y$3*VLOOKUP(Y$2,'Technische Daten'!$A:$P,16,0),0)","v":0},{"$f":"IF(AND(Z$3<>\"\", VLOOKUP(Z$2,'Technische Daten'!$A:$P,12,0) <> 0,VLOOKUP(Z$2,'Technische Daten'!$A:$AA,27,0) = 1),Z$3*VLOOKUP(Z$2,'Technische Daten'!$A:$P,16,0),0)","v":0},{"$f":"IF(AND(AA$3<>\"\", VLOOKUP(AA$2,'Technische Daten'!$A:$P,12,0) <> 0,VLOOKUP(AA$2,'Technische Daten'!$A:$AA,27,0) = 1),AA$3*VLOOKUP(AA$2,'Technische Daten'!$A:$P,16,0),0)","v":0},{"$f":"IF(AND(AB$3<>\"\", VLOOKUP(AB$2,'Technische Daten'!$A:$P,12,0) <> 0,VLOOKUP(AB$2,'Technische Daten'!$A:$AA,27,0) = 1),AB$3*VLOOKUP(AB$2,'Technische Daten'!$A:$P,16,0),0)","v":0},{"$f":"IF(AND(AC$3<>\"\", VLOOKUP(AC$2,'Technische Daten'!$A:$P,12,0) <> 0,VLOOKUP(AC$2,'Technische Daten'!$A:$AA,27,0) = 1),AC$3*VLOOKUP(AC$2,'Technische Daten'!$A:$P,16,0),0)","v":0},{"$f":"IF(AND(AD$3<>\"\", VLOOKUP(AD$2,'Technische Daten'!$A:$P,12,0) <> 0,VLOOKUP(AD$2,'Technische Daten'!$A:$AA,27,0) = 1),AD$3*VLOOKUP(AD$2,'Technische Daten'!$A:$P,16,0),0)","v":0},{"$f":"IF(AND(AE$3<>\"\", VLOOKUP(AE$2,'Technische Daten'!$A:$P,12,0) <> 0,VLOOKUP(AE$2,'Technische Daten'!$A:$AA,27,0) = 1),AE$3*VLOOKUP(AE$2,'Technische Daten'!$A:$P,16,0),0)","v":0},{"$f":"IF(AND(AF$3<>\"\", VLOOKUP(AF$2,'Technische Daten'!$A:$P,12,0) <> 0,VLOOKUP(AF$2,'Technische Daten'!$A:$AA,27,0) = 1),AF$3*VLOOKUP(AF$2,'Technische Daten'!$A:$P,16,0),0)","v":0},{"$f":"IF(AND(AG$3<>\"\", VLOOKUP(AG$2,'Technische Daten'!$A:$P,12,0) <> 0,VLOOKUP(AG$2,'Technische Daten'!$A:$AA,27,0) = 1),AG$3*VLOOKUP(AG$2,'Technische Daten'!$A:$P,16,0),0)","v":0},{"$f":"IF(AND(AH$3<>\"\", VLOOKUP(AH$2,'Technische Daten'!$A:$P,12,0) <> 0,VLOOKUP(AH$2,'Technische Daten'!$A:$AA,27,0) = 1),AH$3*VLOOKUP(AH$2,'Technische Daten'!$A:$P,16,0),0)","v":0},{"$f":"IF(AND(AI$3<>\"\", VLOOKUP(AI$2,'Technische Daten'!$A:$P,12,0) <> 0,VLOOKUP(AI$2,'Technische Daten'!$A:$AA,27,0) = 1),AI$3*VLOOKUP(AI$2,'Technische Daten'!$A:$P,16,0),0)","v":0},{"$f":"IF(AND(AJ$3<>\"\", VLOOKUP(AJ$2,'Technische Daten'!$A:$P,12,0) <> 0,VLOOKUP(AJ$2,'Technische Daten'!$A:$AA,27,0) = 1),AJ$3*VLOOKUP(AJ$2,'Technische Daten'!$A:$P,16,0),0)","v":0},{"$f":"IF(AND(AK$3<>\"\", VLOOKUP(AK$2,'Technische Daten'!$A:$P,12,0) <> 0,VLOOKUP(AK$2,'Technische Daten'!$A:$AA,27,0) = 1),AK$3*VLOOKUP(AK$2,'Technische Daten'!$A:$P,16,0),0)","v":0},{"$f":"IF(AND(AL$3<>\"\", VLOOKUP(AL$2,'Technische Daten'!$A:$P,12,0) <> 0,VLOOKUP(AL$2,'Technische Daten'!$A:$AA,27,0) = 1),AL$3*VLOOKUP(AL$2,'Technische Daten'!$A:$P,16,0),0)","v":0},{"$f":"IF(AND(AM$3<>\"\", VLOOKUP(AM$2,'Technische Daten'!$A:$P,12,0) <> 0,VLOOKUP(AM$2,'Technische Daten'!$A:$AA,27,0) = 1),AM$3*VLOOKUP(AM$2,'Technische Daten'!$A:$P,16,0),0)","v":0},{"$f":"IF(AND(AN$3<>\"\", VLOOKUP(AN$2,'Technische Daten'!$A:$P,12,0) <> 0,VLOOKUP(AN$2,'Technische Daten'!$A:$AA,27,0) = 1),AN$3*VLOOKUP(AN$2,'Technische Daten'!$A:$P,16,0),0)","v":0},{"$f":"IF(AND(AO$3<>\"\", VLOOKUP(AO$2,'Technische Daten'!$A:$P,12,0) <> 0,VLOOKUP(AO$2,'Technische Daten'!$A:$AA,27,0) = 1),AO$3*VLOOKUP(AO$2,'Technische Daten'!$A:$P,16,0),0)","v":0},{"$f":"IF(AND(AP$3<>\"\", VLOOKUP(AP$2,'Technische Daten'!$A:$P,12,0) <> 0,VLOOKUP(AP$2,'Technische Daten'!$A:$AA,27,0) = 1),AP$3*VLOOKUP(AP$2,'Technische Daten'!$A:$P,16,0),0)","v":0},{"$f":"IF(AND(AQ$3<>\"\", VLOOKUP(AQ$2,'Technische Daten'!$A:$P,12,0) <> 0,VLOOKUP(AQ$2,'Technische Daten'!$A:$AA,27,0) = 1),AQ$3*VLOOKUP(AQ$2,'Technische Daten'!$A:$P,16,0),0)","v":0},{"$f":"IF(AND(AR$3<>\"\", VLOOKUP(AR$2,'Technische Daten'!$A:$P,12,0) <> 0,VLOOKUP(AR$2,'Technische Daten'!$A:$AA,27,0) = 1),AR$3*VLOOKUP(AR$2,'Technische Daten'!$A:$P,16,0),0)","v":0},{"$f":"IF(AND(AS$3<>\"\", VLOOKUP(AS$2,'Technische Daten'!$A:$P,12,0) <> 0,VLOOKUP(AS$2,'Technische Daten'!$A:$AA,27,0) = 1),AS$3*VLOOKUP(AS$2,'Technische Daten'!$A:$P,16,0),0)","v":0},{"$f":"IF(AND(AT$3<>\"\", VLOOKUP(AT$2,'Technische Daten'!$A:$P,12,0) <> 0,VLOOKUP(AT$2,'Technische Daten'!$A:$AA,27,0) = 1),AT$3*VLOOKUP(AT$2,'Technische Daten'!$A:$P,16,0),0)","v":0},{"$f":"IF(AND(AU$3<>\"\", VLOOKUP(AU$2,'Technische Daten'!$A:$P,12,0) <> 0,VLOOKUP(AU$2,'Technische Daten'!$A:$AA,27,0) = 1),AU$3*VLOOKUP(AU$2,'Technische Daten'!$A:$P,16,0),0)","v":0},{"$f":"IF(AND(AV$3<>\"\", VLOOKUP(AV$2,'Technische Daten'!$A:$P,12,0) <> 0,VLOOKUP(AV$2,'Technische Daten'!$A:$AA,27,0) = 1),AV$3*VLOOKUP(AV$2,'Technische Daten'!$A:$P,16,0),0)","v":0},null,{"$f":"IF(AND(AX$3<>\"\", VLOOKUP(AX$2,'Technische Daten'!$A:$P,12,0) <> 0,VLOOKUP(AX$2,'Technische Daten'!$A:$AA,27,0) = 1),AX$3*VLOOKUP(AX$2,'Technische Daten'!$A:$P,16,0),0)","v":0}]
["Summe Rest TX",0,null,null,null,null,null,null,null,null,null,null,null,null,null,null,{"$f":"IF(Q$3 <> \"\", Q$3*VLOOKUP(Q$2,'Technische Daten'!$A:$P,15,0),0)","v":0},null,null,null,null,null,null,null,null,null,{"$f":"IF(AA$3 <> \"\", AA$3*VLOOKUP(AA$2,'Technische Daten'!$A:$P,15,0),0)","v":0},null,null,null,null,null,null,null,null,null,null,null,null,{"$f":"IF(AN$3 <> \"\", AN$3*VLOOKUP(AN$2,'Technische Daten'!$A:$P,15,0),0)","v":0},{"$f":"IF(AO$3 <> \"\", AO$3*VLOOKUP(AO$2,'Technische Daten'!$A:$P,15,0),0)","v":0},{"$f":"IF(AP$3 <> \"\", AP$3*VLOOKUP(AP$2,'Technische Daten'!$A:$P,15,0),0)","v":0},{"$f":"IF(AQ$3 <> \"\", AQ$3*VLOOKUP(AQ$2,'Technische Daten'!$A:$P,15,0),0)","v":0},{"$f":"IF(AR$3 <> \"\", AR$3*VLOOKUP(AR$2,'Technische Daten'!$A:$P,15,0),0)","v":0},{"$f":"IF(AS$3 <> \"\", AS$3*VLOOKUP(AS$2,'Technische Daten'!$A:$P,15,0),0)","v":0},{"$f":"IF(AT$3 <> \"\", AT$3*VLOOKUP(AT$2,'Technische Daten'!$A:$P,15,0),0)","v":0}]
["Summe Rest RX",0,null,null,null,null,null,null,null,null,null,null,null,null,null,null,{"$f":"IF(Q$3 <> \"\", Q$3*VLOOKUP(Q$2,'Technische Daten'!$A:$P,16,0),0)","v":0},null,null,null,null,null,null,null,null,null,{"$f":"IF(AA$3 <> \"\", AA$3*VLOOKUP(AA$2,'Technische Daten'!$A:$P,16,0),0)","v":0},null,null,null,null,null,null,null,null,null,null,null,null,{"$f":"IF(AN$3 <> \"\", AN$3*VLOOKUP(AN$2,'Technische Daten'!$A:$P,16,0),0)","v":0},{"$f":"IF(AO$3 <> \"\", AO$3*VLOOKUP(AO$2,'Technische Daten'!$A:$P,16,0),0)","v":0},{"$f":"IF(AP$3 <> \"\", AP$3*VLOOKUP(AP$2,'Technische Daten'!$A:$P,16,0),0)","v":0},{"$f":"IF(AQ$3 <> \"\", AQ$3*VLOOKUP(AQ$2,'Technische Daten'!$A:$P,16,0),0)","v":0},{"$f":"IF(AR$3 <> \"\", AR$3*VLOOKUP(AR$2,'Technische Daten'!$A:$P,16,0),0)","v":0},{"$f":"IF(AS$3 <> \"\", AS$3*VLOOKUP(AS$2,'Technische Daten'!$A:$P,16,0),0)","v":0},{"$f":"IF(AT$3 <> \"\", AT$3*VLOOKUP(AT$2,'Technische Daten'!$A:$P,16,0),0)","v":0}]
[]
["Rückwandbus"]
["Tx (RWB) (Gesamtbetrachtung)",{"$f":"IF(SUM(C85:AX85)>0,ROUNDDOWN(SUM(C85:AX85)/8,0),ROUNDUP(SUM(C85:AX85)/8,0))","v":0},{"$f":"IF(C$3<>\"\",C$3*VLOOKUP(C$2,'Technische Daten'!$A:$G,6,0),0)","v":0},{"$f":"IF(D$3<>\"\",D$3*VLOOKUP(D$2,'Technische Daten'!$A:$G,6,0),0)","v":0},{"$f":"IF(E$3<>\"\",E$3*VLOOKUP(E$2,'Technische Daten'!$A:$G,6,0),0)","v":0},{"$f":"IF(F$3<>\"\",F$3*VLOOKUP(F$2,'Technische Daten'!$A:$G,6,0),0)","v":0},{"$f":"IF(G$3<>\"\",G$3*VLOOKUP(G$2,'Technische Daten'!$A:$G,6,0),0)","v":0},{"$f":"IF(H$3<>\"\",H$3*VLOOKUP(H$2,'Technische Daten'!$A:$G,6,0),0)","v":0},{"$f":"IF(I$3<>\"\",I$3*VLOOKUP(I$2,'Technische Daten'!$A:$G,6,0),0)","v":0},{"$f":"IF(J$3<>\"\",J$3*VLOOKUP(J$2,'Technische Daten'!$A:$G,6,0),0)","v":0},{"$f":"IF(K$3<>\"\",K$3*VLOOKUP(K$2,'Technische Daten'!$A:$G,6,0),0)","v":0},{"$f":"IF(L$3<>\"\",L$3*VLOOKUP(L$2,'Technische Daten'!$A:$G,6,0),0)","v":0},{"$f":"IF(M$3<>\"\",M$3*VLOOKUP(M$2,'Technische Daten'!$A:$G,6,0),0)","v":0},{"$f":"IF(N$3<>\"\",N$3*VLOOKUP(N$2,'Technische Daten'!$A:$G,6,0),0)","v":0},{"$f":"IF(O$3<>\"\",O$3*VLOOKUP(O$2,'Technische Daten'!$A:$G,6,0),0)","v":0},{"$f":"IF(P$3<>\"\",P$3*VLOOKUP(P$2,'Technische Daten'!$A:$G,6,0),0)","v":0},{"$f":"IF(Q$3<>\"\",Q$3*VLOOKUP(Q$2,'Technische Daten'!$A:$G,6,0),0)","v":0},{"$f":"IF(R$3<>\"\",R$3*VLOOKUP(R$2,'Technische Daten'!$A:$G,6,0),0)","v":0},{"$f":"IF(S$3<>\"\",S$3*VLOOKUP(S$2,'Technische Daten'!$A:$G,6,0),0)","v":0},{"$f":"IF(T$3<>\"\",T$3*VLOOKUP(T$2,'Technische Daten'!$A:$G,6,0),0)","v":0},{"$f":"IF(U$3<>\"\",U$3*VLOOKUP(U$2,'Technische Daten'!$A:$G,6,0),0)","v":0},{"$f":"IF(V$3<>\"\",V$3*VLOOKUP(V$2,'Technische Daten'!$A:$G,6,0),0)","v":0},{"$f":"IF(W$3<>\"\",W$3*VLOOKUP(W$2,'Technische Daten'!$A:$G,6,0),0)","v":0},{"$f":"IF(X$3<>\"\",X$3*VLOOKUP(X$2,'Technische Daten'!$A:$G,6,0),0)","v":0},{"$f":"IF(Y$3<>\"\",Y$3*VLOOKUP(Y$2,'Technische Daten'!$A:$G,6,0),0)","v":0},{"$f":"IF(Z$3<>\"\",Z$3*VLOOKUP(Z$2,'Technische Daten'!$A:$G,6,0),0)","v":0},{"$f":"IF(AA$3<>\"\",AA$3*VLOOKUP(AA$2,'Technische Daten'!$A:$G,6,0),0)","v":0},{"$f":"IF(AB$3<>\"\",AB$3*VLOOKUP(AB$2,'Technische Daten'!$A:$G,6,0),0)","v":0},{"$f":"IF(AC$3<>\"\",AC$3*VLOOKUP(AC$2,'Technische Daten'!$A:$G,6,0),0)","v":0},{"$f":"IF(AD$3<>\"\",AD$3*VLOOKUP(AD$2,'Technische Daten'!$A:$G,6,0),0)","v":0},{"$f":"IF(AE$3<>\"\",AE$3*VLOOKUP(AE$2,'Technische Daten'!$A:$G,6,0),0)","v":0},{"$f":"IF(AF$3<>\"\",AF$3*VLOOKUP(AF$2,'Technische Daten'!$A:$G,6,0),0)","v":0},{"$f":"IF(AG$3<>\"\",AG$3*VLOOKUP(AG$2,'Technische Daten'!$A:$G,6,0),0)","v":0},{"$f":"IF(AH$3<>\"\",AH$3*VLOOKUP(AH$2,'Technische Daten'!$A:$G,6,0),0)","v":0},{"$f":"IF(AI$3<>\"\",AI$3*VLOOKUP(AI$2,'Technische Daten'!$A:$G,6,0),0)","v":0},{"$f":"IF(AJ$3<>\"\",AJ$3*VLOOKUP(AJ$2,'Technische Daten'!$A:$G,6,0),0)","v":0},{"$f":"IF(AK$3<>\"\",AK$3*VLOOKUP(AK$2,'Technische Daten'!$A:$G,6,0),0)","v":0},{"$f":"IF(AL$3<>\"\",AL$3*VLOOKUP(AL$2,'Technische Daten'!$A:$G,6,0),0)","v":0},{"$f":"IF(AM$3<>\"\",AM$3*VLOOKUP(AM$2,'Technische Daten'!$A:$G,6,0),0)","v":0},{"$f":"IF(AN$3<>\"\",AN$3*VLOOKUP(AN$2,'Technische Daten'!$A:$G,6,0),0)","v":0},{"$f":"IF(AO$3<>\"\",AO$3*VLOOKUP(AO$2,'Technische Daten'!$A:$G,6,0),0)","v":0},{"$f":"IF(AP$3<>\"\",AP$3*VLOOKUP(AP$2,'Technische Daten'!$A:$G,6,0),0)","v":0},{"$f":"IF(AQ$3<>\"\",AQ$3*VLOOKUP(AQ$2,'Technische Daten'!$A:$G,6,0),0)","v":0},{"$f":"IF(AR$3<>\"\",AR$3*VLOOKUP(AR$2,'Technische Daten'!$A:$G,6,0),0)","v":0},{"$f":"IF(AS$3<>\"\",AS$3*VLOOKUP(AS$2,'Technische Daten'!$A:$G,6,0),0)","v":0},{"$f":"IF(AT$3<>\"\",AT$3*VLOOKUP(AT$2,'Technische Daten'!$A:$G,6,0),0)","v":0},{"$f":"IF(AU$3<>\"\",AU$3*VLOOKUP(AU$2,'Technische Daten'!$A:$G,6,0),0)","v":0},{"$f":"IF(AV$3<>\"\",AV$3*VLOOKUP(AV$2,'Technische Daten'!$A:$G,6,0),0)","v":0},null,{"$f":"IF(AX$3<>\"\",AX$3*VLOOKUP(AX$2,'Technische Daten'!$A:$G,6,0),0)","v":0}]
["Rx (RWB) (Gesamtbetrachtung)",{"$f":"IF(SUM(C86:AX86)>0,ROUNDDOWN(SUM(C86:AX86)/8,0),ROUNDUP(SUM(C86:AX86)/8,0))","v":0},{"$f":"IF(C$3<>\"\",C$3*VLOOKUP(C$2,'Technische Daten'!$A:$G,7,0),0)","v":0},{"$f":"IF(D$3<>\"\",D$3*VLOOKUP(D$2,'Technische Daten'!$A:$G,7,0),0)","v":0},{"$f":"IF(E$3<>\"\",E$3*VLOOKUP(E$2,'Technische Daten'!$A:$G,7,0),0)","v":0},{"$f":"IF(F$3<>\"\",F$3*VLOOKUP(F$2,'Technische Daten'!$A:$G,7,0),0)","v":0},{"$f":"IF(G$3<>\"\",G$3*VLOOKUP(G$2,'Technische Daten'!$A:$G,7,0),0)","v":0},{"$f":"IF(H$3<>\"\",H$3*VLOOKUP(H$2,'Technische Daten'!$A:$G,7,0),0)","v":0},{"$f":"IF(I$3<>\"\",I$3*VLOOKUP(I$2,'Technische Daten'!$A:$G,7,0),0)","v":0},{"$f":"IF(J$3<>\"\",J$3*VLOOKUP(J$2,'Technische Daten'!$A:$G,7,0),0)","v":0},{"$f":"IF(K$3<>\"\",K$3*VLOOKUP(K$2,'Technische Daten'!$A:$G,7,0),0)","v":0},{"$f":"IF(L$3<>\"\",L$3*VLOOKUP(L$2,'Technische Daten'!$A:$G,7,0),0)","v":0},{"$f":"IF(M$3<>\"\",M$3*VLOOKUP(M$2,'Technische Daten'!$A:$G,7,0),0)","v":0},{"$f":"IF(N$3<>\"\",N$3*VLOOKUP(N$2,'Technische Daten'!$A:$G,7,0),0)","v":0},{"$f":"IF(O$3<>\"\",O$3*VLOOKUP(O$2,'Technische Daten'!$A:$G,7,0),0)","v":0},{"$f":"IF(P$3<>\"\",P$3*VLOOKUP(P$2,'Technische Daten'!$A:$G,7,0),0)","v":0},{"$f":"IF(Q$3<>\"\",Q$3*VLOOKUP(Q$2,'Technische Daten'!$A:$G,7,0),0)","v":0},{"$f":"IF(R$3<>\"\",R$3*VLOOKUP(R$2,'Technische Daten'!$A:$G,7,0),0)","v":0},{"$f":"IF(S$3<>\"\",S$3*VLOOKUP(S$2,'Technische Daten'!$A:$G,7,0),0)","v":0},{"$f":"IF(T$3<>\"\",T$3*VLOOKUP(T$2,'Technische Daten'!$A:$G,7,0),0)","v":0},{"$f":"IF(U$3<>\"\",U$3*VLOOKUP(U$2,'Technische Daten'!$A:$G,7,0),0)","v":0},{"$f":"IF(V$3<>\"\",V$3*VLOOKUP(V$2,'Technische Daten'!$A:$G,7,0),0)","v":0},{"$f":"IF(W$3<>\"\",W$3*VLOOKUP(W$2,'Technische Daten'!$A:$G,7,0),0)","v":0},{"$f":"IF(X$3<>\"\",X$3*VLOOKUP(X$2,'Technische Daten'!$A:$G,7,0),0)","v":0},{"$f":"IF(Y$3<>\"\",Y$3*VLOOKUP(Y$2,'Technische Daten'!$A:$G,7,0),0)","v":0},{"$f":"IF(Z$3<>\"\",Z$3*VLOOKUP(Z$2,'Technische Daten'!$A:$G,7,0),0)","v":0},{"$f":"IF(AA$3<>\"\",AA$3*VLOOKUP(AA$2,'Technische Daten'!$A:$G,7,0),0)","v":0},{"$f":"IF(AB$3<>\"\",AB$3*VLOOKUP(AB$2,'Technische Daten'!$A:$G,7,0),0)","v":0},{"$f":"IF(AC$3<>\"\",AC$3*VLOOKUP(AC$2,'Technische Daten'!$A:$G,7,0),0)","v":0},{"$f":"IF(AD$3<>\"\",AD$3*VLOOKUP(AD$2,'Technische Daten'!$A:$G,7,0),0)","v":0},{"$f":"IF(AE$3<>\"\",AE$3*VLOOKUP(AE$2,'Technische Daten'!$A:$G,7,0),0)","v":0},{"$f":"IF(AF$3<>\"\",AF$3*VLOOKUP(AF$2,'Technische Daten'!$A:$G,7,0),0)","v":0},{"$f":"IF(AG$3<>\"\",AG$3*VLOOKUP(AG$2,'Technische Daten'!$A:$G,7,0),0)","v":0},{"$f":"IF(AH$3<>\"\",AH$3*VLOOKUP(AH$2,'Technische Daten'!$A:$G,7,0),0)","v":0},{"$f":"IF(AI$3<>\"\",AI$3*VLOOKUP(AI$2,'Technische Daten'!$A:$G,7,0),0)","v":0},{"$f":"IF(AJ$3<>\"\",AJ$3*VLOOKUP(AJ$2,'Technische Daten'!$A:$G,7,0),0)","v":0},{"$f":"IF(AK$3<>\"\",AK$3*VLOOKUP(AK$2,'Technische Daten'!$A:$G,7,0),0)","v":0},{"$f":"IF(AL$3<>\"\",AL$3*VLOOKUP(AL$2,'Technische Daten'!$A:$G,7,0),0)","v":0},{"$f":"IF(AM$3<>\"\",AM$3*VLOOKUP(AM$2,'Technische Daten'!$A:$G,7,0),0)","v":0},{"$f":"IF(AN$3<>\"\",AN$3*VLOOKUP(AN$2,'Technische Daten'!$A:$G,7,0),0)","v":0},{"$f":"IF(AO$3<>\"\",AO$3*VLOOKUP(AO$2,'Technische Daten'!$A:$G,7,0),0)","v":0},{"$f":"IF(AP$3<>\"\",AP$3*VLOOKUP(AP$2,'Technische Daten'!$A:$G,7,0),0)","v":0},{"$f":"IF(AQ$3<>\"\",AQ$3*VLOOKUP(AQ$2,'Technische Daten'!$A:$G,7,0),0)","v":0},{"$f":"IF(AR$3<>\"\",AR$3*VLOOKUP(AR$2,'Technische Daten'!$A:$G,7,0),0)","v":0},{"$f":"IF(AS$3<>\"\",AS$3*VLOOKUP(AS$2,'Technische Daten'!$A:$G,7,0),0)","v":0},{"$f":"IF(AT$3<>\"\",AT$3*VLOOKUP(AT$2,'Technische Daten'!$A:$G,7,0),0)","v":0},{"$f":"IF(AU$3<>\"\",AU$3*VLOOKUP(AU$2,'Technische Daten'!$A:$G,7,0),0)","v":0},{"$f":"IF(AV$3<>\"\",AV$3*VLOOKUP(AV$2,'Technische Daten'!$A:$G,7,0),0)","v":0},null,{"$f":"IF(AX$3<>\"\",AX$3*VLOOKUP(AX$2,'Technische Daten'!$A:$G,7,0),0)","v":0}]
["Tx (RWB) (nur Slave)",{"$f":"IF(SUM(J87:AX87)>0,ROUNDDOWN(SUM(J87:AX87)/8,0),ROUNDUP(SUM(J87:AX87)/8,0))","v":0},{"$f":"IF(C$3<>\"\",C$3*VLOOKUP(C$2,'Technische Daten'!$A:$G,6,0),0)","v":0},{"$f":"IF(D$3<>\"\",D$3*VLOOKUP(D$2,'Technische Daten'!$A:$G,6,0),0)","v":0},{"$f":"IF(E$3<>\"\",E$3*VLOOKUP(E$2,'Technische Daten'!$A:$G,6,0),0)","v":0},{"$f":"IF(F$3<>\"\",F$3*VLOOKUP(F$2,'Technische Daten'!$A:$G,6,0),0)","v":0},{"$f":"IF(G$3<>\"\",G$3*VLOOKUP(G$2,'Technische Daten'!$A:$G,6,0),0)","v":0},{"$f":"IF(H$3<>\"\",H$3*VLOOKUP(H$2,'Technische Daten'!$A:$G,6,0),0)","v":0},{"$f":"IF(I$3<>\"\",I$3*VLOOKUP(I$2,'Technische Daten'!$A:$G,6,0),0)","v":0},{"$f":"IF(J$3<>\"\",J$3*VLOOKUP(J$2,'Technische Daten'!$A:$G,6,0),0)","v":0},{"$f":"IF(K$3<>\"\",K$3*VLOOKUP(K$2,'Technische Daten'!$A:$G,6,0),0)","v":0},{"$f":"IF(L$3<>\"\",L$3*VLOOKUP(L$2,'Technische Daten'!$A:$G,6,0),0)","v":0},{"$f":"IF(M$3<>\"\",M$3*VLOOKUP(M$2,'Technische Daten'!$A:$G,6,0),0)","v":0},{"$f":"IF(N$3<>\"\",N$3*VLOOKUP(N$2,'Technische Daten'!$A:$G,6,0),0)","v":0},{"$f":"IF(O$3<>\"\",O$3*VLOOKUP(O$2,'Technische Daten'!$A:$G,6,0),0)","v":0},{"$f":"IF(P$3<>\"\",P$3*VLOOKUP(P$2,'Technische Daten'!$A:$G,6,0),0)","v":0},{"$f":"IF(Q$3<>\"\",Q$3*VLOOKUP(Q$2,'Technische Daten'!$A:$G,6,0),0)","v":0},{"$f":"IF(R$3<>\"\",R$3*VLOOKUP(R$2,'Technische Daten'!$A:$G,6,0),0)","v":0},{"$f":"IF(S$3<>\"\",S$3*VLOOKUP(S$2,'Technische Daten'!$A:$G,6,0),0)","v":0},{"$f":"IF(T$3<>\"\",T$3*VLOOKUP(T$2,'Technische Daten'!$A:$G,6,0),0)","v":0},{"$f":"IF(U$3<>\"\",U$3*VLOOKUP(U$2,'Technische Daten'!$A:$G,6,0),0)","v":0},{"$f":"IF(V$3<>\"\",V$3*VLOOKUP(V$2,'Technische Daten'!$A:$G,6,0),0)","v":0},{"$f":"IF(W$3<>\"\",W$3*VLOOKUP(W$2,'Technische Daten'!$A:$G,6,0),0)","v":0},{"$f":"IF(X$3<>\"\",X$3*VLOOKUP(X$2,'Technische Daten'!$A:$G,6,0),0)","v":0},{"$f":"IF(Y$3<>\"\",Y$3*VLOOKUP(Y$2,'Technische Daten'!$A:$G,6,0),0)","v":0},{"$f":"IF(Z$3<>\"\",Z$3*VLOOKUP(Z$2,'Technische Daten'!$A:$G,6,0),0)","v":0},{"$f":"IF(AA$3<>\"\",AA$3*VLOOKUP(AA$2,'Technische Daten'!$A:$G,6,0),0)","v":0},{"$f":"IF(AB$3<>\"\",AB$3*VLOOKUP(AB$2,'Technische Daten'!$A:$G,6,0),0)","v":0},{"$f":"IF(AC$3<>\"\",AC$3*VLOOKUP(AC$2,'Technische Daten'!$A:$G,6,0),0)","v":0},{"$f":"IF(AD$3<>\"\",AD$3*VLOOKUP(AD$2,'Technische Daten'!$A:$G,6,0),0)","v":0},{"$f":"IF(AE$3<>\"\",AE$3*VLOOKUP(AE$2,'Technische Daten'!$A:$G,6,0),0)","v":0},{"$f":"IF(AF$3<>\"\",AF$3*VLOOKUP(AF$2,'Technische Daten'!$A:$G,6,0),0)","v":0},{"$f":"IF(AG$3<>\"\",AG$3*VLOOKUP(AG$2,'Technische Daten'!$A:$G,6,0),0)","v":0},{"$f":"IF(AH$3<>\"\",AH$3*VLOOKUP(AH$2,'Technische Daten'!$A:$G,6,0),0)","v":0},{"$f":"IF(AI$3<>\"\",AI$3*VLOOKUP(AI$2,'Technische Daten'!$A:$G,6,0),0)","v":0},{"$f":"IF(AJ$3<>\"\",AJ$3*VLOOKUP(AJ$2,'Technische Daten'!$A:$G,6,0),0)","v":0},{"$f":"IF(AK$3<>\"\",AK$3*VLOOKUP(AK$2,'Technische Daten'!$A:$G,6,0),0)","v":0},{"$f":"IF(AL$3<>\"\",AL$3*VLOOKUP(AL$2,'Technische Daten'!$A:$G,6,0),0)","v":0},{"$f":"IF(AM$3<>\"\",AM$3*VLOOKUP(AM$2,'Technische Daten'!$A:$G,6,0),0)","v":0},{"$f":"IF(AN$3<>\"\",AN$3*VLOOKUP(AN$2,'Technische Daten'!$A:$G,6,0),0)","v":0},{"$f":"IF(AO$3<>\"\",AO$3*VLOOKUP(AO$2,'Technische Daten'!$A:$G,6,0),0)","v":0},{"$f":"IF(AP$3<>\"\",AP$3*VLOOKUP(AP$2,'Technische Daten'!$A:$G,6,0),0)","v":0},{"$f":"IF(AQ$3<>\"\",AQ$3*VLOOKUP(AQ$2,'Technische Daten'!$A:$G,6,0),0)","v":0},{"$f":"IF(AR$3<>\"\",AR$3*VLOOKUP(AR$2,'Technische Daten'!$A:$G,6,0),0)","v":0},{"$f":"IF(AS$3<>\"\",AS$3*VLOOKUP(AS$2,'Technische Daten'!$A:$G,6,0),0)","v":0},{"$f":"IF(AT$3<>\"\",AT$3*VLOOKUP(AT$2,'Technische Daten'!$A:$G,6,0),0)","v":0},{"$f":"IF(AU$3<>\"\",AU$3*VLOOKUP(AU$2,'Technische Daten'!$A:$G,6,0),0)","v":0},{"$f":"IF(AV$3<>\"\",AV$3*VLOOKUP(AV$2,'Technische Daten'!$A:$G,6,0),0)","v":0},null,{"$f":"IF(AX$3<>\"\",AX$3*VLOOKUP(AX$2,'Technische Daten'!$A:$G,6,0),0)","v":0}]
["Rx (RWB) (nur Slave)",{"$f":"IF(SUM(J88:AX88)>0,ROUNDDOWN(SUM(J88:AX88)/8,0),ROUNDUP(SUM(J88:AX88)/8,0))","v":0},{"$f":"IF(C$3<>\"\",C$3*VLOOKUP(C$2,'Technische Daten'!$A:$G,7,0),0)","v":0},{"$f":"IF(D$3<>\"\",D$3*VLOOKUP(D$2,'Technische Daten'!$A:$G,7,0),0)","v":0},{"$f":"IF(E$3<>\"\",E$3*VLOOKUP(E$2,'Technische Daten'!$A:$G,7,0),0)","v":0},{"$f":"IF(F$3<>\"\",F$3*VLOOKUP(F$2,'Technische Daten'!$A:$G,7,0),0)","v":0},{"$f":"IF(G$3<>\"\",G$3*VLOOKUP(G$2,'Technische Daten'!$A:$G,7,0),0)","v":0},{"$f":"IF(H$3<>\"\",H$3*VLOOKUP(H$2,'Technische Daten'!$A:$G,7,0),0)","v":0},{"$f":"IF(I$3<>\"\",I$3*VLOOKUP(I$2,'Technische Daten'!$A:$G,7,0),0)","v":0},{"$f":"IF(J$3<>\"\",J$3*VLOOKUP(J$2,'Technische Daten'!$A:$G,7,0),0)","v":0},{"$f":"IF(K$3<>\"\",K$3*VLOOKUP(K$2,'Technische Daten'!$A:$G,7,0),0)","v":0},{"$f":"IF(L$3<>\"\",L$3*VLOOKUP(L$2,'Technische Daten'!$A:$G,7,0),0)","v":0},{"$f":"IF(M$3<>\"\",M$3*VLOOKUP(M$2,'Technische Daten'!$A:$G,7,0),0)","v":0},{"$f":"IF(N$3<>\"\",N$3*VLOOKUP(N$2,'Technische Daten'!$A:$G,7,0),0)","v":0},{"$f":"IF(O$3<>\"\",O$3*VLOOKUP(O$2,'Technische Daten'!$A:$G,7,0),0)","v":0},{"$f":"IF(P$3<>\"\",P$3*VLOOKUP(P$2,'Technische Daten'!$A:$G,7,0),0)","v":0},{"$f":"IF(Q$3<>\"\",Q$3*VLOOKUP(Q$2,'Technische Daten'!$A:$G,7,0),0)","v":0},{"$f":"IF(R$3<>\"\",R$3*VLOOKUP(R$2,'Technische Daten'!$A:$G,7,0),0)","v":0},{"$f":"IF(S$3<>\"\",S$3*VLOOKUP(S$2,'Technische Daten'!$A:$G,7,0),0)","v":0},{"$f":"IF(T$3<>\"\",T$3*VLOOKUP(T$2,'Technische Daten'!$A:$G,7,0),0)","v":0},{"$f":"IF(U$3<>\"\",U$3*VLOOKUP(U$2,'Technische Daten'!$A:$G,7,0),0)","v":0},{"$f":"IF(V$3<>\"\",V$3*VLOOKUP(V$2,'Technische Daten'!$A:$G,7,0),0)","v":0},{"$f":"IF(W$3<>\"\",W$3*VLOOKUP(W$2,'Technische Daten'!$A:$G,7,0),0)","v":0},{"$f":"IF(X$3<>\"\",X$3*VLOOKUP(X$2,'Technische Daten'!$A:$G,7,0),0)","v":0},{"$f":"IF(Y$3<>\"\",Y$3*VLOOKUP(Y$2,'Technische Daten'!$A:$G,7,0),0)","v":0},{"$f":"IF(Z$3<>\"\",Z$3*VLOOKUP(Z$2,'Technische Daten'!$A:$G,7,0),0)","v":0},{"$f":"IF(AA$3<>\"\",AA$3*VLOOKUP(AA$2,'Technische Daten'!$A:$G,7,0),0)","v":0},{"$f":"IF(AB$3<>\"\",AB$3*VLOOKUP(AB$2,'Technische Daten'!$A:$G,7,0),0)","v":0},{"$f":"IF(AC$3<>\"\",AC$3*VLOOKUP(AC$2,'Technische Daten'!$A:$G,7,0),0)","v":0},{"$f":"IF(AD$3<>\"\",AD$3*VLOOKUP(AD$2,'Technische Daten'!$A:$G,7,0),0)","v":0},{"$f":"IF(AE$3<>\"\",AE$3*VLOOKUP(AE$2,'Technische Daten'!$A:$G,7,0),0)","v":0},{"$f":"IF(AF$3<>\"\",AF$3*VLOOKUP(AF$2,'Technische Daten'!$A:$G,7,0),0)","v":0},{"$f":"IF(AG$3<>\"\",AG$3*VLOOKUP(AG$2,'Technische Daten'!$A:$G,7,0),0)","v":0},{"$f":"IF(AH$3<>\"\",AH$3*VLOOKUP(AH$2,'Technische Daten'!$A:$G,7,0),0)","v":0},{"$f":"IF(AI$3<>\"\",AI$3*VLOOKUP(AI$2,'Technische Daten'!$A:$G,7,0),0)","v":0},{"$f":"IF(AJ$3<>\"\",AJ$3*VLOOKUP(AJ$2,'Technische Daten'!$A:$G,7,0),0)","v":0},{"$f":"IF(AK$3<>\"\",AK$3*VLOOKUP(AK$2,'Technische Daten'!$A:$G,7,0),0)","v":0},{"$f":"IF(AL$3<>\"\",AL$3*VLOOKUP(AL$2,'Technische Daten'!$A:$G,7,0),0)","v":0},{"$f":"IF(AM$3<>\"\",AM$3*VLOOKUP(AM$2,'Technische Daten'!$A:$G,7,0),0)","v":0},{"$f":"IF(AN$3<>\"\",AN$3*VLOOKUP(AN$2,'Technische Daten'!$A:$G,7,0),0)","v":0},{"$f":"IF(AO$3<>\"\",AO$3*VLOOKUP(AO$2,'Technische Daten'!$A:$G,7,0),0)","v":0},{"$f":"IF(AP$3<>\"\",AP$3*VLOOKUP(AP$2,'Technische Daten'!$A:$G,7,0),0)","v":0},{"$f":"IF(AQ$3<>\"\",AQ$3*VLOOKUP(AQ$2,'Technische Daten'!$A:$G,7,0),0)","v":0},{"$f":"IF(AR$3<>\"\",AR$3*VLOOKUP(AR$2,'Technische Daten'!$A:$G,7,0),0)","v":0},{"$f":"IF(AS$3<>\"\",AS$3*VLOOKUP(AS$2,'Technische Daten'!$A:$G,7,0),0)","v":0},{"$f":"IF(AT$3<>\"\",AT$3*VLOOKUP(AT$2,'Technische Daten'!$A:$G,7,0),0)","v":0},{"$f":"IF(AU$3<>\"\",AU$3*VLOOKUP(AU$2,'Technische Daten'!$A:$G,7,0),0)","v":0},{"$f":"IF(AV$3<>\"\",AV$3*VLOOKUP(AV$2,'Technische Daten'!$A:$G,7,0),0)","v":0},null,{"$f":"IF(AX$3<>\"\",AX$3*VLOOKUP(AX$2,'Technische Daten'!$A:$G,7,0),0)","v":0}]
[]
["Overhead durch Header (Ausgänge, Rx)",{"$f":"(-1) * ROUNDUP(B88/64,0) * 8","v":0}]
["Gesamt Rx Bytes",{"$f":"B90+(B88 * (-1))","v":0}]
["Gesamt Rx Bits",{"$f":"B91*10","v":0}]
["Anzahl zu durchlaufender Module",{"$f":"SUM(J3:AT3)","v":0}]
["Übertragungszeit Rx (ns)",{"$f":"(B92+B93) * 20 * 2 + 2700","v":2700}]
["Antworttelegramme je Modul (byte)",null,null,null,null,null,null,null,null,{"$f":"ROUNDUP(IF(J$3<>\"\",VLOOKUP(J$2,'Technische Daten'!$A:$G,6,0),0) / (-8),0)","v":0},{"$f":"ROUNDUP(IF(K$3<>\"\",VLOOKUP(K$2,'Technische Daten'!$A:$G,6,0),0) / (-8),0)","v":0},{"$f":"ROUNDUP(IF(L$3<>\"\",VLOOKUP(L$2,'Technische Daten'!$A:$G,6,0),0) / (-8),0)","v":0},{"$f":"ROUNDUP(IF(M$3<>\"\",VLOOKUP(M$2,'Technische Daten'!$A:$G,6,0),0) / (-8),0)","v":0},{"$f":"ROUNDUP(IF(N$3<>\"\",VLOOKUP(N$2,'Technische Daten'!$A:$G,6,0),0) / (-8),0)","v":0},{"$f":"ROUNDUP(IF(O$3<>\"\",VLOOKUP(O$2,'Technische Daten'!$A:$G,6,0),0) / (-8),0)","v":0},{"$f":"ROUNDUP(IF(P$3<>\"\",VLOOKUP(P$2,'Technische Daten'!$A:$G,6,0),0) / (-8),0)","v":0},{"$f":"ROUNDUP(IF(Q$3<>\"\",VLOOKUP(Q$2,'Technische Daten'!$A:$G,6,0),0) / (-8),0)","v":0},{"$f":"ROUNDUP(IF(R$3<>\"\",VLOOKUP(R$2,'Technische Daten'!$A:$G,6,0),0) / (-8),0)","v":0},{"$f":"ROUNDUP(IF(S$3<>\"\",VLOOKUP(S$2,'Technische Daten'!$A:$G,6,0),0) / (-8),0)","v":0},{"$f":"ROUNDUP(IF(T$3<>\"\",VLOOKUP(T$2,'Technische Daten'!$A:$G,6,0),0) / (-8),0)","v":0},{"$f":"ROUNDUP(IF(U$3<>\"\",VLOOKUP(U$2,'Technische Daten'!$A:$G,6,0),0) / (-8),0)","v":0},{"$f":"ROUNDUP(IF(V$3<>\"\",VLOOKUP(V$2,'Technische Daten'!$A:$G,6,0),0) / (-8),0)","v":0},{"$f":"ROUNDUP(IF(W$3<>\"\",VLOOKUP(W$2,'Technische Daten'!$A:$G,6,0),0) / (-8),0)","v":0},{"$f":"ROUNDUP(IF(X$3<>\"\",VLOOKUP(X$2,'Technische Daten'!$A:$G,6,0),0) / (-8),0)","v":0},{"$f":"ROUNDUP(IF(Y$3<>\"\",VLOOKUP(Y$2,'Technische Daten'!$A:$G,6,0),0) / (-8),0)","v":0},{"$f":"ROUNDUP(IF(Z$3<>\"\",VLOOKUP(Z$2,'Technische Daten'!$A:$G,6,0),0) / (-8),0)","v":0},{"$f":"ROUNDUP(IF(AA$3<>\"\",VLOOKUP(AA$2,'Technische Daten'!$A:$G,6,0),0) / (-8),0)","v":0},{"$f":"ROUNDUP(IF(AB$3<>\"\",VLOOKUP(AB$2,'Technische Daten'!$A:$G,6,0),0) / (-8),0)","v":0},{"$f":"ROUNDUP(IF(AC$3<>\"\",VLOOKUP(AC$2,'Technische Daten'!$A:$G,6,0),0) / (-8),0)","v":0},{"$f":"ROUNDUP(IF(AD$3<>\"\",VLOOKUP(AD$2,'Technische Daten'!$A:$G,6,0),0) / (-8),0)","v":0},{"$f":"ROUNDUP(IF(AE$3<>\"\",VLOOKUP(AE$2,'Technische Daten'!$A:$G,6,0),0) / (-8),0)","v":0},{"$f":"ROUNDUP(IF(AF$3<>\"\",VLOOKUP(AF$2,'Technische Daten'!$A:$G,6,0),0) / (-8),0)","v":0},{"$f":"ROUNDUP(IF(AG$3<>\"\",VLOOKUP(AG$2,'Technische Daten'!$A:$G,6,0),0) / (-8),0)","v":0},{"$f":"ROUNDUP(IF(AH$3<>\"\",VLOOKUP(AH$2,'Technische Daten'!$A:$G,6,0),0) / (-8),0)","v":0},{"$f":"ROUNDUP(IF(AI$3<>\"\",VLOOKUP(AI$2,'Technische Daten'!$A:$G,6,0),0) / (-8),0)","v":0},{"$f":"ROUNDUP(IF(AJ$3<>\"\",VLOOKUP(AJ$2,'Technische Daten'!$A:$G,6,0),0) / (-8),0)","v":0},{"$f":"ROUNDUP(IF(AK$3<>\"\",VLOOKUP(AK$2,'Technische Daten'!$A:$G,6,0),0) / (-8),0)","v":0},{"$f":"ROUNDUP(IF(AL$3<>\"\",VLOOKUP(AL$2,'Technische Daten'!$A:$G,6,0),0) / (-8),0)","v":0},{"$f":"ROUNDUP(IF(AM$3<>\"\",VLOOKUP(AM$2,'Technische Daten'!$A:$G,6,0),0) / (-8),0)","v":0},{"$f":"ROUNDUP(IF(AN$3<>\"\",VLOOKUP(AN$2,'Technische Daten'!$A:$G,6,0),0) / (-8),0)","v":0},{"$f":"ROUNDUP(IF(AO$3<>\"\",VLOOKUP(AO$2,'Technische Daten'!$A:$G,6,0),0) / (-8),0)","v":0},{"$f":"ROUNDUP(IF(AP$3<>\"\",VLOOKUP(AP$2,'Technische Daten'!$A:$G,6,0),0) / (-8),0)","v":0},{"$f":"ROUNDUP(IF(AQ$3<>\"\",VLOOKUP(AQ$2,'Technische Daten'!$A:$G,6,0),0) / (-8),0)","v":0},{"$f":"ROUNDUP(IF(AR$3<>\"\",VLOOKUP(AR$2,'Technische Daten'!$A:$G,6,0),0) / (-8),0)","v":0},{"$f":"ROUNDUP(IF(AS$3<>\"\",VLOOKUP(AS$2,'Technische Daten'!$A:$G,6,0),0) / (-8),0)","v":0},{"$f":"ROUNDUP(IF(AT$3<>\"\",VLOOKUP(AT$2,'Technische Daten'!$A:$G,6,0),0) / (-8),0)","v":0}]
["dazu Antworttelegramm-Aufschlag je Modul",null,null,null,null,null,null,null,null,{"$f":"IF(J95 > 0, IF(J95 < 12,J95+3+3,J95+5+3),0)","v":0},0,0,0,0,0,0,{"$f":"IF(Q95 > 0, IF(Q95 < 12,Q95+3+3,Q95+5+3),0)","v":0},{"$f":"IF(R95 > 0, IF(R95 < 12,R95+3+3,R95+5+3),0)","v":0},0,0,0,0,0,0,0,0,0,0,0,0,0,0,0,0,0,0,0,0,0,0,0,0,0,0,0,0]
["Gesamt Tx Bytes",{"$f":"4 + SUM(J97:AT97)","v":4},null,null,null,null,null,null,null,{"$f":"J96*J$3","v":0},0,0,0,0,0,0,{"$f":"Q96*Q$3","v":0},{"$f":"R96*R$3","v":0},0,0,0,0,0,0,0,0,0,0,0,0,0,0,0,0,0,0,0,0,0,0,0,0,0,0,0,0]
["Gesamt Tx Bits",{"$f":"10 * B97","v":40}]
["reine Übertragungszeit Tx (ns)",{"$f":"B98 * 20","v":800}]
["Durchlaufzeit Anfrage Tx (ns)",{"$f":"SUM(J100:AT100) * 2 * 10","v":0},null,null,null,null,null,null,null,{"$f":"J$3","v":0},0,0,0,0,0,0,{"$f":"Q$3","v":0},{"$f":"R$3","v":0},0,0,0,0,0,0,0,0,0,0,0,0,0,0,0,0,0,0,0,0,0,0,0,0,0,0,0,0]
["Durchlaufzeit Antwort Tx (ns)",{"$f":" 10 * (SUM(J101:AT101) - 1) * SUM(J101:AT101)/2","v":0},null,null,null,null,null,null,null,0,0,0,0,0,0,0,{"$f":"Q$3","v":0},0,0,0,0,0,0,0,0,0,0,0,0,0,0,0,0,0,0,0,0,0,0,0,0,0,0,0,0,0]
["Übertragungszeit Tx Gesamt (ns)",{"$f":"(B99+B100+B101)* 2","v":1600}]
["Restzykluszeit (µs)",{"$f":"((('Technische Daten'!AB8 - 200) * 1000) - B94 - B102) / 1000","v":795.7}]
["prozentuale Auslastung",{"$f":"('Technische Daten'!AB8 - Konfiguration!B103)/'Technische Daten'!AB8","v":0.20429999999999995}]

{"sheet":"Technische Daten","index":1,"n_rows":71,"n_cols":28,"rows_kept":71,"cut":false,"hidden":true,"merged":[]}
["Typ","Elektronikstrom",{"$f":"IF(Konfiguration!B5 = Texte!B107,'Technische Daten'!N1,'Technische Daten'!M1)","v":"I/O Strom max"},"I/O Strom zusätzlich fest","zusätzlicher I/O-Strom (Annahme)","max. Eingangs-PDO Tx (Bit)","max. Ausgangs-PDO Rx (Bit)","Parameter","Anzahl DI","Anzahl DO","Anzahl AI","Anzahl AO","I/O Strom max","I/O Strom UL","Eingangs-PDO Tx (Bit) CAN Drive-based (7 PDOs frei, 2 feste kommen ggf hinzu)","Ausgangs-PDO Rx CAN Drive-based(Bit) (7 PDOs frei, 2 feste kommen ggf hinzu)","min. Eingangs-PDO Tx (Bit)","min. Ausgangs-PDO Rx (Bit)","EPM-S110","EPM-S120","EPM-S130","EPM-S140","EPM-S150","EPM-S160","3200 C","Breite (mm)","Drive based festes PDO","min Zykluszeit (µs)"]
["EPM-S110",3000,{"$f":"HLOOKUP($C$1,$M:$N,ROW()-ROW($B$1)+1,FALSE)","v":10000},null,null,{"$f":"16*8*8","v":1024},{"$f":"16*8*8","v":1024},null,null,null,null,null,10000,7000,512,512,{"$f":"16*8*8","v":1024},{"$f":"16*8*8","v":1024},null,null,null,null,null,null,null,48]
["EPM-S120",3000,10000,null,null,{"$f":"244*8","v":1952},{"$f":"244*8","v":1952},{"$f":"224*8","v":1792},null,null,null,null,10000,7000,null,null,{"$f":"244*8","v":1952},{"$f":"244*8","v":1952},null,null,null,null,null,null,null,48]
["EPM-S130",3000,10000,null,null,{"$f":"1024*4*8","v":32768},{"$f":"1024*4*8","v":32768},null,null,null,null,null,10000,7000,null,null,{"$f":"F4","v":32768},32768,null,null,null,null,null,null,null,48]
["EPM-S140",3000,10000,null,null,{"$f":"512*8","v":4096},{"$f":"512*8","v":4096},{"$f":"4068*8","v":32544},null,null,null,null,10000,7000,null,null,4096,4096,null,null,null,null,null,null,null,48]
["EPM-S150",3000,10000,null,null,{"$f":"256*8","v":2048},{"$f":"256*8","v":2048},null,null,null,null,null,10000,7000,null,null,2048,2048,null,null,null,null,null,null,null,48]
["EPM-S160",3000,10000,null,null,{"$f":"1024*8","v":8192},{"$f":"1024*8","v":8192},null,null,null,null,null,10000,7000,null,null,8192,8192,null,null,null,null,null,null,null,48]
["3200 C",1700,0,null,null,{"$f":"(2048-256)*8","v":14336},null,null,null,null,null,null,0,0,null,null,{"$f":"2048-128","v":1920},null,null,null,null,null,null,null,null,136,null,1000]
["EPM-S200",-55,{"$f":"HLOOKUP($C$1,$M:$N,ROW()-ROW($B$1)+1,FALSE)","v":0},null,null,{"$f":"HLOOKUP($C$71,$S:$Y,ROW()-ROW($B$1)+1,FALSE)","v":-2},null,0,2,null,null,null,null,null,{"$f":"S9","v":-2},{"$f":"G9","v":0},{"$f":"F9","v":-2},null,-2,-8,-8,-8,-8,-8,-2,12.5,1]
["EPM-S201",-55,0,null,null,-4,null,0,4,null,null,null,null,null,{"$f":"S10","v":-4},0,{"$f":"F10","v":-4},null,-4,-8,-8,-8,-8,-8,-4,12.5,1]
["EPM-S202",-60,0,null,null,-8,null,0,8,null,null,null,null,null,-8,0,-8,null,-8,-8,-8,-8,-8,-8,-8,12.5,1]
["EPM-S203",-55,0,null,null,-4,null,0,4,null,null,null,null,null,-4,0,-4,null,-4,-8,-8,-8,-8,-8,-4,12.5,1]
["EPM-S204",-60,0,null,null,-2,null,0,2,null,null,null,null,null,-2,0,-2,null,-2,-8,-8,-8,-8,-8,-2,12.5,1]
["EPM-S205",-60,0,null,null,-4,null,0,4,null,null,null,null,null,-4,0,-4,null,-4,-8,-8,-8,-8,-8,-4,12.5,1]
["EPM-S206",-65,0,null,null,-8,null,0,8,null,null,null,null,null,-8,0,-8,null,-8,-8,-8,-8,-8,-8,-8,12.5,1]
["EPM-S207",-85,0,null,null,-256,null,{"$f":"-6*8","v":-48},2,null,null,null,null,null,{"$f":"F16","v":-256},0,{"$f":"-4*8","v":-32},null,{"$f":"-60*8","v":-480},-480,-480,-480,-480,-480,{"$f":"-32*8","v":-256},12.5]
["EPM-S208",null,0,null,null,null,null,null,null,null,null,null,null,null,0,0,null,null,null,null,null,null,null,null,null,12.5]
["EPM-S300",-55,-1000,-5,null,null,{"$f":"HLOOKUP($C$71,$S:$Y,ROW()-ROW($B$1)+1,FALSE)","v":-2},0,null,2,null,null,-1000,-1000,0,{"$f":"S18","v":-2},null,{"$f":"G18","v":-2},-2,-8,-8,-8,-8,-8,-2,12.5,1]
["EPM-S301",-55,-2000,-10,null,null,-4,0,null,4,null,null,-2000,-2000,0,{"$f":"S19","v":-4},null,{"$f":"G19","v":-4},-4,-8,-8,-8,-8,-8,-4,12.5,1]
["EPM-S302",-65,-4000,-15,null,null,-8,0,null,8,null,null,-4000,-4000,0,-8,null,-8,-8,-8,-8,-8,-8,-8,-8,12.5,1]
["EPM-S303",-60,-1000,-3,null,null,-2,0,null,2,null,null,-1000,-1000,0,-2,null,-2,-2,-8,-8,-8,-8,-8,-2,12.5,1]
["EPM-S304",-65,-2000,-5,null,null,-4,0,null,4,null,null,-2000,-2000,0,-4,null,-4,-4,-8,-8,-8,-8,-8,-4,12.5,1]
["EPM-S305",-70,-4000,-10,null,null,-8,0,null,8,null,null,-4000,-4000,0,-8,null,-8,-8,-8,-8,-8,-8,-8,-8,12.5,1]
["EPM-S306",-55,-4000,-5,null,null,-2,0,null,2,null,null,-4000,-4000,0,-2,null,-2,-2,-8,-8,-8,-8,-8,-2,12.5,1]
["EPM-S308",-55,0,0,null,null,-2,0,null,null,null,null,0,0,0,-2,null,-2,-2,-8,-8,-8,-8,-8,-2,12.5,1]
["EPM-S309",-55,-4000,-10,null,null,-4,0,null,4,null,null,-4000,-4000,0,-4,null,-4,-4,-8,-8,-8,-8,-8,-4,12.5,1]
["EPM-S310",-85,-1000,-14,null,{"$f":"-4*8","v":-32},-256,{"$f":"-2*8","v":-16},null,2,null,null,-1000,-1000,{"$f":"F27","v":-32},-256,null,{"$f":"-24*8","v":-192},{"$f":"-60*8","v":-480},-480,-480,-480,-480,-480,{"$f":"-32*8","v":-256},12.5]
["EPM-S311",null,{"$f":"HLOOKUP($C$1,$M:$N,ROW()-ROW($B$1)+1,FALSE)","v":0},null,null,null,null,null,null,null,null,null,null,null,0,0,null,null,null,null,null,null,null,null,null,12.5]
["EPM-S400",-70,0,-15,null,-32,null,-48,null,null,2,null,null,null,-32,0,-32,null,null,null,null,null,null,null,null,12.5,1]
["EPM-S401",-70,0,-15,null,-64,null,-64,null,null,4,null,null,null,-64,0,-64,null,null,null,null,null,null,null,null,12.5,1]
["EPM-S402",-70,0,-15,null,-32,null,-48,null,null,2,null,null,null,-32,0,-32,null,null,null,null,null,null,null,null,12.5,1]
["EPM-S403",-70,0,-15,null,-64,null,-64,null,null,4,null,null,null,-64,0,-64,null,null,null,null,null,null,null,null,12.5,1]
["EPM-S404",-75,0,-30,null,-64,null,{"$f":"-34*8","v":-272},null,null,4,null,null,null,-64,0,-64,null,null,null,null,null,null,null,null,12.5,1]
["EPM-S405",-75,0,-30,null,-32,null,{"$f":"-22*8","v":-176},null,null,2,null,null,null,-32,0,-32,null,null,null,null,null,null,null,null,12.5,1]
["EPM-S406",-60,0,-20,null,-32,null,{"$f":"-20*8","v":-160},null,null,2,null,null,null,-32,0,-32,null,null,null,null,null,null,null,null,12.5,1]
["EPM-S407",null,0,null,null,-64,null,null,null,null,null,null,null,null,-64,0,-64,null,null,null,null,null,null,null,null,12.5]
["EPM-S408",-60,0,-20,null,-32,null,{"$f":"-20*8","v":-160},null,null,2,null,null,null,-32,0,-32,null,null,null,null,null,null,null,null,12.5,1]
["EPM-S409",null,0,null,null,-64,null,null,null,null,null,null,null,null,-64,0,-64,null,null,null,null,null,null,null,null,12.5]
["EPM-S500",-80,0,-35,null,null,-32,-64,null,null,null,2,null,null,0,-32,null,-32,null,null,null,null,null,null,null,12.5,1]
["EPM-S501",-80,0,-35,null,null,-64,-80,null,null,null,4,null,null,0,-64,null,-64,null,null,null,null,null,null,null,12.5,1]
["EPM-S502",-80,0,-15,-40,null,-32,-64,null,null,null,2,null,null,{"$f":"F41","v":0},{"$f":"G41","v":-32},null,-32,null,null,null,null,null,null,null,12.5,1]
["EPM-S503",-80,0,-15,-80,null,-64,-80,null,null,null,4,null,null,0,-64,null,-64,null,null,null,null,null,null,null,12.5,1]
["EPM-S600",-75,-500,-20,-200,-96,-80,{"$f":"-21*8","v":-168},null,1,null,null,null,null,-96,-80,-96,-80,null,null,null,null,null,null,null,12.5]
["EPM-S601",-75,{"$f":"HLOOKUP($C$1,$M:$N,ROW()-ROW($B$1)+1,FALSE)","v":0},-15,-400,-96,-96,{"$f":"-42*8","v":-336},null,null,null,null,null,null,-96,-96,-96,-96,null,null,null,null,null,null,null,12.5]
["EPM-S602",-75,{"$f":"HLOOKUP($C$1,$M:$N,ROW()-ROW($B$1)+1,FALSE)","v":0},-20,-200,-64,-80,{"$f":"-22*8","v":-176},null,null,null,null,null,null,-64,-80,-64,-80,null,null,null,null,null,null,null,12.5]
["EPM-S603",-100,{"$f":"HLOOKUP($C$1,$M:$N,ROW()-ROW($B$1)+1,FALSE)","v":0},-15,-200,-96,-32,{"$f":"-8*8","v":-64},null,null,null,null,null,null,-96,-32,-96,-32,null,null,null,null,null,null,null,12.5]
["EPM-S604",-70,{"$f":"HLOOKUP($C$1,$M:$N,ROW()-ROW($B$1)+1,FALSE)","v":0},-30,-250,-48,null,{"$f":"-33*8","v":-264},null,null,null,null,null,null,-48,0,-48,null,null,null,null,null,null,null,null,12.5]
["EPM-S620",-95,-1000,-14,null,{"$f":"-12*8","v":-96},{"$f":"-4*8","v":-32},{"$f":"-8*8","v":-64},null,null,null,null,null,null,-96,-32,null,null,null,null,null,null,null,null,null,12.5]
["EPM-S640",-100,null,-10,-10,{"$f":"HLOOKUP($C$71,$S:$Y,ROW()-ROW($B$1)+1,FALSE)","v":-480},{"$f":"HLOOKUP($C$71,$S:$Y,ROW()-ROW($B$1)+1,FALSE)","v":-480},{"$f":"-17*8","v":-136},null,null,null,null,null,null,-480,-480,-480,-480,{"$f":"-8*8","v":-64},{"$f":"-20*8","v":-160},{"$f":"-60*8","v":-480},-480,-480,-480,-480,12.5]
["EPM-S650",-100,null,-10,-10,{"$f":"HLOOKUP($C$71,$S:$Y,ROW()-ROW($B$1)+1,FALSE)","v":-480},{"$f":"HLOOKUP($C$71,$S:$Y,ROW()-ROW($B$1)+1,FALSE)","v":-480},{"$f":"-17*8","v":-136},null,null,null,null,null,null,{"$f":"F50","v":-480},{"$f":"G50","v":-480},-480,-480,{"$f":"-8*8","v":-64},{"$f":"-20*8","v":-160},-480,-480,-480,-480,-480,12.5]
["EPM-S700",3000,{"$f":"HLOOKUP($C$1,$M:$N,ROW()-ROW($B$1)+1,FALSE)","v":10000},null,null,null,null,null,null,null,null,null,10000,7000,0,0,null,null,null,null,null,null,null,null,null,12.5]
["EPM-S701",0,10000,null,null,null,null,null,null,null,null,null,10000,7000,0,0,null,null,null,null,null,null,null,null,null,12.5]
["EPM-S702",2000,4000,null,null,null,null,null,null,null,null,null,4000,4000,0,0,null,null,null,null,null,null,null,null,null,12.5]
["EPM-S703",0,10000,null,null,null,null,null,null,null,null,null,10000,7000,{"$f":"F54","v":0},{"$f":"G54","v":0},null,null,null,null,null,null,null,null,null,12.5]
["EPM-S800",null,0,null,null,null,null,null,null,null,null,null,null,null,0,0,null,null,null,null,null,null,null,null,null,12.5]
["EPM-S820",null,0,null,null,null,null,null,null,null,null,null,null,null,0,0,null,null,null,null,null,null,null,null,null,12.5]
["EPM-S840",null,0,null,null,null,null,null,null,null,null,null,null,null,0,0,null,null,null,null,null,null,null,null,null,12.5]
["EPM-S900",null,0,null,null,null,null,null,null,null,null,null,null,null,0,0,null,null,null,null,null,null,null,null,null,12.5]
["EPM-S910",null,0,null,null,null,null,null,null,null,null,null,null,null,0,0,null,null,null,null,null,null,null,null,null,12.5]
["EPM-S911",null,0,null,null,null,null,null,null,null,null,null,null,null,0,0,null,null,null,null,null,null,null,null,null,12.5]
["EPM-S912",null,0,null,null,null,null,null,null,null,null,null,null,null,0,0,null,null,null,null,null,null,null,null,null,12.5]
[]
[]
[]
[]
[]
[]
[]
[]
[]
["aktuelles Bussystem:",null,{"$f":"IF(EPM_S110<>0,\"EPM-S110\",IF(EPM_S120<>0,\"EPM-S120\",IF(EPM_S130<>0,\"EPM-S130\",IF(EPM_S140<>0,\"EPM-S140\",IF(EPM_S150<>0,\"EPM-S150\",IF(EPM_S160<>0,\"EPM-S160\",\"3200 C\"))))))","v":"3200 C"}]

{"sheet":"Texte","index":2,"n_rows":116,"n_cols":6,"rows_kept":116,"cut":false,"hidden":true,"merged":[]}
["Sprache",{"$f":"Konfiguration!A2","v":"DE"},null,"DE","EN"]
[null,{"$f":"HLOOKUP($B$1,$D:$K,ROW()-ROW($B$1)+1,FALSE)","v":"Elektronikversorgung"},null,"Elektronikversorgung","Electronics Supply"]
[null,"Gesamtstrombelastung Elektronik (A)",null,"Gesamtstrombelastung Elektronik (A)","total current electronics (A)"]
[null,"Einspeisestrom Elektronik (A)",null,"Einspeisestrom Elektronik (A)","available supply current electronics (A)"]
[null,"benötigte Powermodule EPM-S702",null,"benötigte Powermodule EPM-S702","number supply modules EPM-S701/702"]
[null,"Konfigurationscheck",null,"Konfigurationscheck","Configuration Check"]
[null,"I/O-Versorgung",null,"I/O-Versorgung","I/O supply"]
[null,"Gesamtstrom I/O (A)",null,"Gesamtstrom I/O (A)","total current I/O (A)"]
[null,"Einspeisestrom I/O (A)",null,"Einspeisestrom I/O (A)","available supply current I/O (A)"]
[null,"benötigte Powermodule EPM-S701",null,"benötigte Powermodule EPM-S701","number supply modules EPM-S701",1]
[null,"Konfigurationscheck",null,"Konfigurationscheck","Configuration Check"]
[null,"Kommunikation (CAN) Controller-based",null,"Kommunikation (CAN) Controller-based","Communication (CAN) Controller-based"]
[null,"Anzahl verbleibende Rx-PDO (Byte)",null,"Anzahl verbleibende Rx-PDO (Byte)","Number remaining Rx-PDO (Byte)"]
[null,"Anzahl verbleibende Tx-PDO (Byte)",null,"Anzahl verbleibende Tx-PDO (Byte)","Number remaining Tx-PDO (Byte)"]
[null,"Anzahl Parameter (Byte)",null,"Anzahl Parameter (Byte)","Anzahl Parameter (Byte)"]
[null,"Konfigurationscheck",null,"Konfigurationscheck","Configuration Check"]
[null,"Kommunikation (CAN) Drive-based",null,"Kommunikation (CAN) Drive-based","Communication (CAN) Drive-based"]
[null,"Anzahl verbleibende Rx-PDO (Byte)",null,"Anzahl verbleibende Rx-PDO (Byte)","Number remaining Rx-PDO (Byte)"]
[null,"Anzahl verbleibende Tx-PDO (Byte)",null,"Anzahl verbleibende Tx-PDO (Byte)","Number remaining Tx-PDO (Byte)"]
[null,"Anzahl Parameter (Byte)",null,"Anzahl Parameter (Byte)","Anzahl Parameter (Byte)"]
[null,"Konfigurationscheck",null,"Konfigurationscheck","Configuration Check"]
[null,"Kommunikation (PROFIBUS)",null,"Kommunikation (PROFIBUS)","Communication (PROFIBUS)"]
[null,"Kommunikation (PROFINET)",null,"Kommunikation (PROFINET)","Communication (PROFINET)"]
[null,"Anzahl verbleibende Rx-PDO (Byte)",null,"Anzahl verbleibende Rx-PDO (Byte)","Number remaining Rx-PDO (Byte)"]
[null,"Anzahl verbleibende Tx-PDO (Byte)",null,"Anzahl verbleibende Tx-PDO (Byte)","Number remaining Tx-PDO (Byte)"]
[null,"Anzahl Parameter (Byte)",null,"Anzahl Parameter (Byte)","Number Parameter (Byte)"]
[null,"Konfigurationscheck",null,"Konfigurationscheck","Configuration Check"]
[null,"Kommunikation (EtherCAT)",null,"Kommunikation (EtherCAT)","Communication (EtherCAT)"]
[null,"Anzahl verbleibende Rx-PDO (Byte)",null,"Anzahl verbleibende Rx-PDO (Byte)","Number remaining Rx-PDO (Byte)"]
[null,"Anzahl verbleibende Tx-PDO (Byte)",null,"Anzahl verbleibende Tx-PDO (Byte)","Number remaining Tx-PDO (Byte)"]
[null,"Anzahl Parameter (Byte)",null,"Anzahl Parameter (Byte)","Number Parameter (Byte)"]
[null,"Konfigurationscheck",null,"Konfigurationscheck","Configuration Check"]
[null,"Übersicht",null,"Übersicht","Overview"]
[null,"Gesamtanzahl Module (ohne Versorgung) ",null,"Gesamtanzahl Module (ohne Versorgung) ","Total number modules (without supply)"]
[null,"Gesamtanzahl digitale Eingänge",null,"Gesamtanzahl digitale Eingänge","Total number digutal inputs"]
[null,"Gesamtanzahl digitale Ausgänge",null,"Gesamtanzahl digitale Ausgänge","Total number digital outputs"]
[null,"Gesamtanzahl analoge Eingänge",null,"Gesamtanzahl analoge Eingänge","Total number analog inputs"]
[null,"Gesamtanzahl analoge Ausgänge",null,"Gesamtanzahl analoge Ausgänge","Total number analog outputs"]
[null,"Kommunikation (DeviceNet)",null,"Kommunikation (DeviceNet)","Communication (DeviceNet)"]
[null,"Kommunikation (Modbus TCP)",null,"Kommunikation (Modbus TCP)","Communication (Modbus TCP)"]
[null,"Kommunikation (Rückwandbus)",null,"Kommunikation (Rückwandbus)","Communication (I/O backplane bus)"]
[null,"Auslastung Rückwandbus",null,"Auslastung Rückwandbus","Backplane bus load"]
[]
[null,{"$f":"HLOOKUP($B$1,$D:$K,ROW()-ROW($B$1)+1,FALSE)","v":"durchschnittliche Ausgangsbelastung(%)"},null,"durchschnittliche Ausgangsbelastung(%)","average output load (%)"]
["EPM-S110","CANopen",null,"CANopen","CANopen"]
["EPM-S120","PROFIBUS",null,"PROFIBUS","PROFIBUS"]
["EPM-S130","EtherCAT",null,"EtherCAT","EtherCAT"]
["EPM-S140","PROFINET",null,"PROFINET","PROFINET"]
["EPM-S150","DeviceNet",null,"DeviceNet","DeviceNet"]
["EPM-S160","Modbus TCP",null,"Modbus TCP","Modbus TCP"]
["3200 C","L-force Controller",null,"L-force Controller","L-force Controller"]
["EPM-S200","2 DI",null,"2 DI","2 DI"]
["EPM-S201","4 DI",null,"4 DI","4 DI"]
["EPM-S202","8 DI",null,"8 DI","8 DI"]
["EPM-S203","4 DI 3-Leiter",null,"4 DI 3-Leiter","4 DI 3-wire"]
["EPM-S204","2 DI NPN",null,"2 DI NPN","2 DI NPN"]
["EPM-S205","4 DI NPN",null,"4 DI NPN","4 DI NPN"]
["EPM-S206","8 DI NPN",null,"8 DI NPN","8 DI NPN"]
["EPM-S207","2 DI 2µs",null,"2 DI 2µs","2 DI 2µs"]
["EPM-S300","2 DO",null,"2 DO","2 DO"]
["EPM-S301","4 DO",null,"4 DO","4 DO"]
["EPM-S302","8 DO",null,"8 DO","8 DO"]
["EPM-S303","2 DO NPN",null,"2 DO NPN","2 DO NPN"]
["EPM-S304","4 DO NPN",null,"4 DO NPN","4 DO NPN"]
["EPM-S305","8 DO NPN",null,"8 DO NPN","8 DO NPN"]
["EPM-S306","2 DO 2A",null,"2 DO 2A","2 DO 2A"]
["EPM-S308","2 DO Relais",null,"2 DO Relais","2 DO Relais"]
["EPM-S309","4 DO 2A",null,"4 DO 2A","4 DO 2A"]
["EPM-S310","2 DO 1µs",null,"2 DO 1µs","2 DO 1µs"]
["EPM-S400","2 AI 0..10V",null,"2 AI 0..10V","2 AI 0..10V"]
["EPM-S401","4 AI 0..10V",null,"4 AI 0..10V","4 AI 0..10V"]
["EPM-S402","2 AI 0(4)-20mA",null,"2 AI 0(4)-20mA","2 AI 0(4)-20mA"]
["EPM-S403","4 AI 0(4)-20mA",null,"4 AI 0(4)-20mA","4 AI 0(4)-20mA"]
["EPM-S404","4 AI Resistor",null,"4 AI Resistor","4 AI Resistor"]
["EPM-S405","2 AI Thermo",null,"2 AI Thermo","2 AI Thermo"]
["EPM-S406",{"$f":"HLOOKUP($B$1,$D:$K,ROW()-ROW($B$1)+1,FALSE)","v":"2 AI -10..10 V 16 Bit"},null,"2 AI -10..10 V 16 Bit","2 AI -10..10V 16 Bit"]
["EPM-S408","2 AI 0(4)..20 mA 16 Bit",null,"2 AI 0(4)..20 mA 16 Bit","2 AI 0(4)..20 mA 16 Bit"]
["EPM-S500","2 AO 0..10V",null,"2 AO 0..10V","2 AO 0..10V"]
["EPM-S501","4 AO 0..10V",null,"4 AO 0..10V","4 AO 0..10V"]
["EPM-S502","2 AO 4..20mA",null,"2 AO 4..20mA","2 AO 4..20mA"]
["EPM-S503","4 AO 4..20mA",null,"4 AO 4..20mA","4 AO 4..20mA"]
["EPM-S600","1-fach Zähler 24 V / 1 DO",null,"1-fach Zähler 24 V / 1 DO","1-way Counter 24 V / 1 DO"]
["EPM-S601","2-fach Zähler 24 V",null,"2-fach Zähler 24 V","2-way Counter 24 V"]
["EPM-S602","1-fach Zähler 5 V",null,"1-fach Zähler 5 V","1-way Counter 5 V"]
["EPM-S603","2-fach Zähler 24 V",null,"2-fach Zähler 24 V","2-way Counter 24 V"]
["EPM-S604","SSI",null,"SSI","SSI"]
["EPM-S620","PWM",null,"PWM","PWM"]
["EPM-S640","RS 232",null,"RS 232","RS 232"]
["EPM-S650","RS 422/485",null,"RS 422/485","RS 422/485"]
["EPM-S700","Hauptversorgung",null,"Hauptversorgung","Main supply"]
["EPM-S701","I/O-Versorgung (Sicherung)",null,"I/O-Versorgung (Sicherung)","I/O-supply (incl. fuse)"]
["EPM-S702","I/O / Elektronik",null,"I/O / Elektronik","I/O / Elektronics"]
["EPM-S703","I/O-Versorgung",null,"I/O-Versorgung","I/O-supply"]
[]
[null,{"$f":"HLOOKUP($B$1,$D:$K,ROW()-ROW($B$1)+1,FALSE)","v":"Es kann nur 1 Buskoppler je Station ausgewählt werden"},null,"Es kann nur 1 Buskoppler je Station ausgewählt werden","It is only possible to configure 1 bus coupler per station"]
[]
[null,{"$f":"HLOOKUP($B$1,$D:$K,ROW()-ROW($B$1)+1,FALSE)","v":"Buskoppler"},null,"Buskoppler","Bus coupler"]
[null,"Modulposition",null,"Modulposition","Module position"]
[null,"Modul",null,"Modul","Module"]
[null,"Funktion",null,"Funktion","Function"]
[null,"Ausgangsstrom je Kanal (mA)",null,"Ausgangsstrom je Kanal (mA)","Output current per channel (mA)"]
[null,"verfügbarer Ausgangsstrom (A)",null,"verfügbarer Ausgangsstrom (A)","available output current (A)"]
[null,"verfügbarer Elektronikstrom (A)",null,"verfügbarer Elektronikstrom (A)","available electronics current (A)"]
[null,"Summe physikalischer Aufbau",null,"Summe physikalischer Aufbau","Total count physical configuration"]
[]
[null,{"$f":"HLOOKUP($B$1,$D:$K,ROW()-ROW($B$1)+1,FALSE)","v":"Stromschienenbelastung (UL)"},null,"Stromschienenbelastung (UL)","rail current"]
[null,{"$f":"HLOOKUP($B$1,$D:$K,ROW()-ROW($B$1)+1,FALSE)","v":"7A"},null,"7A","7A"]
[null,{"$f":"HLOOKUP($B$1,$D:$K,ROW()-ROW($B$1)+1,FALSE)","v":"10A"},null,"10A","10A"]
[]
[null,{"$f":"HLOOKUP($B$1,$D:$K,ROW()-ROW($B$1)+1,FALSE)","v":"Laststrom je Kanal (mA) (Geber, AO)"},null,"Laststrom je Kanal (mA) (Geber, AO)","Load current per channel (mA) (Encoder, AO)"]
[]
[null,{"$f":"HLOOKUP($B$1,$D:$K,ROW()-ROW($B$1)+1,FALSE)","v":"Mechanische Abmaße"},null,"Mechanische Abmaße","Mechanical Data"]
[null,{"$f":"HLOOKUP($B$1,$D:$K,ROW()-ROW($B$1)+1,FALSE)","v":"Breite (mm)"},null,"Breite (mm)","Width (mm)"]
[null,{"$f":"HLOOKUP($B$1,$D:$K,ROW()-ROW($B$1)+1,FALSE)","v":"x"},null,"x","x"]
[null,{"$f":"HLOOKUP($B$1,$D:$K,ROW()-ROW($B$1)+1,FALSE)","v":"zusätzliche Versorgung einfügen"},null,"zusätzliche Versorgung einfügen","insert additional supply"]
[null,{"$f":"HLOOKUP($B$1,$D:$K,ROW()-ROW($B$1)+1,FALSE)","v":"Eingabe Bedarf"},null,"Eingabe Bedarf","Enter required modules"]

{"sheet":"physikalischer Aufbau","index":3,"n_rows":132,"n_cols":17,"rows_kept":132,"cut":false,"hidden":false,"merged":[[1,1,1,2]]}
[]
[null,null,null,{"$f":"Texte!B99","v":"Modul"},{"$f":"Texte!B100","v":"Funktion"},"ist DO","max Strom je Kanal",{"$f":"Texte!B101","v":"Ausgangsstrom je Kanal (mA)"},{"$f":"Texte!B110","v":"Laststrom je Kanal (mA) (Geber, AO)"},"Laststrom default","Ausgangsstrom",{"$f":"Texte!B102","v":"verfügbarer Ausgangsstrom (A)"},{"$f":"Texte!B103","v":"verfügbarer Elektronikstrom (A)"},"Elektronikstrom","Zeile anzeigen",{"$f":"Texte!B115","v":"zusätzliche Versorgung einfügen"}]
[]
["EPM-S110",{"$f":"Texte!B97","v":"Buskoppler"},null,null,{"$f":"IF(D4<>\"\",VLOOKUP(D4,Texte!A$45:B$107,2,0),\"\")","v":""},null,null,null,null,null,{"$f":"VLOOKUP($D4,'Technische Daten'!$A:$L,3,0)","v":{"$error":"#N/A"}},{"$f":"IF(D4 <> \"\",K4,0)","v":0},{"$f":"N4","v":0},{"$f":"IF($D4 <> \"\",VLOOKUP($D4,'Technische Daten'!$A:$L,2,0),0)","v":0},1]
["EPM-S120",null,null,null,null,null,null,null,null,null,{"$f":"IF($D5 <> \"\",VLOOKUP($D5,'Technische Daten'!$A:$L,3,0),0)","v":0},{"$f":"IF(D5 <> \"\",K5,0)","v":0},null,{"$f":"IF($D5 <> \"\",VLOOKUP($D5,'Technische Daten'!$A:$L,2,0),0)","v":0},{"$f":"IF(OR(L6 < 0,M6 < 0,D5 <> \"\",P6<> \"\"),1,0)","v":0}]
["EPM-S130",{"$f":"Texte!$B$98","v":"Modulposition"},{"$f":"(ROW() - 4)/ 2","v":1},null,{"$f":"IF(D6<>\"\",VLOOKUP(D6,Texte!A$45:B$107,2,0),\"\")","v":""},{"$f":"IF(VLOOKUP($D6,'Technische Daten'!$A:$L,10,0) <> \"\",1,0)","v":{"$error":"#N/A"}},{"$f":"IF(F6 = 1,VLOOKUP($D6,'Technische Daten'!$A:$L,3,0) / VLOOKUP($D6,'Technische Daten'!$A:$L,10,0) * (-1),0)","v":{"$error":"#N/A"}},null,null,{"$f":"VLOOKUP($D6,'Technische Daten'!$A:$L,5,0)","v":{"$error":"#N/A"}},{"$f":"IF($D6 <> \"\",VLOOKUP($D6,'Technische Daten'!$A:$L,4,0) - VLOOKUP($D6,'Technische Daten'!$A:$L,10,0) * H6 - I6,0)","v":0},{"$f":"IF(D6<>\"\",K4+K5+K6,\"\")","v":""},{"$f":"IF(D6 <> \"\",IF(N4 <> 0,N4+N6,M3+N4+N6),\"\")","v":""},{"$f":"IF($D6 <> \"\",VLOOKUP($D6,'Technische Daten'!$A:$L,2,0),0)","v":0},1,null,{"$f":"Texte!B114","v":"x"}]
["EPM-S140",null,null,null,{"$f":"IF(D7<>\"\",VLOOKUP(D7,Texte!A$45:B$107,2,0),\"\")","v":""},null,null,null,null,null,{"$f":"IF($D7 <> \"\",VLOOKUP($D7,'Technische Daten'!$A:$L,3,0),0)","v":0},{"$f":"K7","v":0},{"$f":"IF(N7 = 0,M6,N7)","v":""},{"$f":"IF($D7 <> \"\",VLOOKUP($D7,'Technische Daten'!$A:$L,2,0),0)","v":0},{"$f":"IF(OR(L8 < 0,M8 < 0,D7 <> \"\",P8 <> 0),1,0)","v":0}]
["EPM-S150",{"$f":"Texte!$B$98","v":"Modulposition"},{"$f":"(ROW() - 4)/ 2","v":2},null,{"$f":"IF(D8<>\"\",VLOOKUP(D8,Texte!A$45:B$107,2,0),\"\")","v":""},{"$f":"IF(VLOOKUP($D8,'Technische Daten'!$A:$L,10,0) <> \"\",1,0)","v":{"$error":"#N/A"}},{"$f":"IF(F8 = 1,VLOOKUP($D8,'Technische Daten'!$A:$L,3,0) / VLOOKUP($D8,'Technische Daten'!$A:$L,10,0) * (-1),0)","v":{"$error":"#N/A"}},null,null,{"$f":"VLOOKUP($D8,'Technische Daten'!$A:$L,5,0)","v":{"$error":"#N/A"}},{"$f":"IF($D8 <> \"\",VLOOKUP($D8,'Technische Daten'!$A:$L,4,0) - VLOOKUP($D8,'Technische Daten'!$A:$L,10,0) * H8 - I8,0)","v":0},{"$f":"IF(D8<>\"\",IF(D7<>\"\",K7+K8, L6+K7+K8),\"\")","v":""},{"$f":"IF(D8 <> \"\",IF(N7 <> 0,N7+N8,M6+N7+N8),\"\")","v":""},{"$f":"IF($D8 <> \"\",VLOOKUP($D8,'Technische Daten'!$A:$L,2,0),0)","v":0},{"$f":"IF(D6 <> \"\",1,0)","v":0}]
["EPM-S160",null,null,null,{"$f":"IF(D9<>\"\",VLOOKUP(D9,Texte!A$45:B$107,2,0),\"\")","v":""},null,null,null,null,null,{"$f":"IF($D9 <> \"\",VLOOKUP($D9,'Technische Daten'!$A:$L,3,0),0)","v":0},{"$f":"K9","v":0},{"$f":"IF(N9 = 0,M8,N9)","v":""},{"$f":"IF($D9 <> \"\",VLOOKUP($D9,'Technische Daten'!$A:$L,2,0),0)","v":0},{"$f":"IF(OR(L10 < 0,M10 < 0,D9 <> \"\",P10 <> 0),1,0)","v":0}]
["3200 C",{"$f":"Texte!$B$98","v":"Modulposition"},{"$f":"(ROW() - 4)/ 2","v":3},null,{"$f":"IF(D10<>\"\",VLOOKUP(D10,Texte!A$45:B$107,2,0),\"\")","v":""},{"$f":"IF(VLOOKUP($D10,'Technische Daten'!$A:$L,10,0) <> \"\",1,0)","v":{"$error":"#N/A"}},{"$f":"IF(F10 = 1,VLOOKUP($D10,'Technische Daten'!$A:$L,3,0) / VLOOKUP($D10,'Technische Daten'!$A:$L,10,0) * (-1),0)","v":{"$error":"#N/A"}},null,null,{"$f":"VLOOKUP($D10,'Technische Daten'!$A:$L,5,0)","v":{"$error":"#N/A"}},{"$f":"IF($D10 <> \"\",VLOOKUP($D10,'Technische Daten'!$A:$L,4,0) - VLOOKUP($D10,'Technische Daten'!$A:$L,10,0) * H10 - I10,0)","v":0},"",{"$f":"IF(D10 <> \"\",IF(N9 <> 0,N9+N10,M8+N9+N10),\"\")","v":""},{"$f":"IF($D10 <> \"\",VLOOKUP($D10,'Technische Daten'!$A:$L,2,0),0)","v":0},{"$f":"IF(D8 <> \"\",1,0)","v":0}]
[null,null,null,null,{"$f":"IF(D11<>\"\",VLOOKUP(D11,Texte!A$45:B$107,2,0),\"\")","v":""},null,null,null,null,null,{"$f":"IF($D11 <> \"\",VLOOKUP($D11,'Technische Daten'!$A:$L,3,0),0)","v":0},{"$f":"K11","v":0},{"$f":"IF(N11 = 0,M10,N11)","v":""},{"$f":"IF($D11 <> \"\",VLOOKUP($D11,'Technische Daten'!$A:$L,2,0),0)","v":0},{"$f":"IF(OR(L12 < 0,M12 < 0,D11 <> \"\",P12 <> 0),1,0)","v":0}]
[null,{"$f":"Texte!$B$98","v":"Modulposition"},{"$f":"(ROW() - 4)/ 2","v":4},null,{"$f":"IF(D12<>\"\",VLOOKUP(D12,Texte!A$45:B$107,2,0),\"\")","v":""},{"$f":"IF(VLOOKUP($D12,'Technische Daten'!$A:$L,10,0) <> \"\",1,0)","v":{"$error":"#N/A"}},{"$f":"IF(F12 = 1,VLOOKUP($D12,'Technische Daten'!$A:$L,3,0) / VLOOKUP($D12,'Technische Daten'!$A:$L,10,0) * (-1),0)","v":{"$error":"#N/A"}},null,null,{"$f":"VLOOKUP($D12,'Technische Daten'!$A:$L,5,0)","v":{"$error":"#N/A"}},{"$f":"IF($D12 <> \"\",VLOOKUP($D12,'Technische Daten'!$A:$L,4,0) - VLOOKUP($D12,'Technische Daten'!$A:$L,10,0) * H12 - I12,0)","v":0},"",{"$f":"IF(D12 <> \"\",IF(N11 <> 0,N11+N12,M10+N11+N12),\"\")","v":""},{"$f":"IF($D12 <> \"\",VLOOKUP($D12,'Technische Daten'!$A:$L,2,0),0)","v":0},{"$f":"IF(D10 <> \"\",1,0)","v":0}]
[null,null,null,null,{"$f":"IF(D13<>\"\",VLOOKUP(D13,Texte!A$45:B$107,2,0),\"\")","v":""},null,null,null,null,null,{"$f":"IF($D13 <> \"\",VLOOKUP($D13,'Technische Daten'!$A:$L,3,0),0)","v":0},{"$f":"K13","v":0},{"$f":"IF(N13 = 0,M12,N13)","v":""},{"$f":"IF($D13 <> \"\",VLOOKUP($D13,'Technische Daten'!$A:$L,2,0),0)","v":0},{"$f":"IF(OR(L14 < 0,M14 < 0,D13 <> \"\",P14 <> 0),1,0)","v":0}]
[null,{"$f":"Texte!$B$98","v":"Modulposition"},{"$f":"(ROW() - 4)/ 2","v":5},null,{"$f":"IF(D14<>\"\",VLOOKUP(D14,Texte!A$45:B$107,2,0),\"\")","v":""},{"$f":"IF(VLOOKUP($D14,'Technische Daten'!$A:$L,10,0) <> \"\",1,0)","v":{"$error":"#N/A"}},{"$f":"IF(F14 = 1,VLOOKUP($D14,'Technische Daten'!$A:$L,3,0) / VLOOKUP($D14,'Technische Daten'!$A:$L,10,0) * (-1),0)","v":{"$error":"#N/A"}},null,null,{"$f":"VLOOKUP($D14,'Technische Daten'!$A:$L,5,0)","v":{"$error":"#N/A"}},{"$f":"IF($D14 <> \"\",VLOOKUP($D14,'Technische Daten'!$A:$L,4,0) - VLOOKUP($D14,'Technische Daten'!$A:$L,10,0) * H14 - I14,0)","v":0},"",{"$f":"IF(D14 <> \"\",IF(N13 <> 0,N13+N14,M12+N13+N14),\"\")","v":""},{"$f":"IF($D14 <> \"\",VLOOKUP($D14,'Technische Daten'!$A:$L,2,0),0)","v":0},{"$f":"IF(D12 <> \"\",1,0)","v":0}]
[null,null,null,null,{"$f":"IF(D15<>\"\",VLOOKUP(D15,Texte!A$45:B$107,2,0),\"\")","v":""},null,null,null,null,null,{"$f":"IF($D15 <> \"\",VLOOKUP($D15,'Technische Daten'!$A:$L,3,0),0)","v":0},{"$f":"K15","v":0},{"$f":"IF(N15 = 0,M14,N15)","v":""},{"$f":"IF($D15 <> \"\",VLOOKUP($D15,'Technische Daten'!$A:$L,2,0),0)","v":0},{"$f":"IF(OR(L16 < 0,M16 < 0,D15 <> \"\",P16 <> 0),1,0)","v":0}]
["EPM-S200",{"$f":"Texte!$B$98","v":"Modulposition"},{"$f":"(ROW() - 4)/ 2","v":6},null,{"$f":"IF(D16<>\"\",VLOOKUP(D16,Texte!A$45:B$107,2,0),\"\")","v":""},{"$f":"IF(VLOOKUP($D16,'Technische Daten'!$A:$L,10,0) <> \"\",1,0)","v":{"$error":"#N/A"}},{"$f":"IF(F16 = 1,VLOOKUP($D16,'Technische Daten'!$A:$L,3,0) / VLOOKUP($D16,'Technische Daten'!$A:$L,10,0) * (-1),0)","v":{"$error":"#N/A"}},null,null,{"$f":"VLOOKUP($D16,'Technische Daten'!$A:$L,5,0)","v":{"$error":"#N/A"}},{"$f":"IF($D16 <> \"\",VLOOKUP($D16,'Technische Daten'!$A:$L,4,0) - VLOOKUP($D16,'Technische Daten'!$A:$L,10,0) * H16 - I16,0)","v":0},"",{"$f":"IF(D16 <> \"\",IF(N15 <> 0,N15+N16,M14+N15+N16),\"\")","v":""},{"$f":"IF($D16 <> \"\",VLOOKUP($D16,'Technische Daten'!$A:$L,2,0),0)","v":0},{"$f":"IF(D14 <> \"\",1,0)","v":0}]
["EPM-S201",null,null,null,{"$f":"IF(D17<>\"\",VLOOKUP(D17,Texte!A$45:B$107,2,0),\"\")","v":""},null,null,null,null,null,{"$f":"IF($D17 <> \"\",VLOOKUP($D17,'Technische Daten'!$A:$L,3,0),0)","v":0},{"$f":"K17","v":0},{"$f":"IF(N17 = 0,M16,N17)","v":""},{"$f":"IF($D17 <> \"\",VLOOKUP($D17,'Technische Daten'!$A:$L,2,0),0)","v":0},{"$f":"IF(OR(L18 < 0,M18 < 0,D17 <> \"\",P18 <> 0),1,0)","v":0}]
["EPM-S202",{"$f":"Texte!$B$98","v":"Modulposition"},{"$f":"(ROW() - 4)/ 2","v":7},null,{"$f":"IF(D18<>\"\",VLOOKUP(D18,Texte!A$45:B$107,2,0),\"\")","v":""},{"$f":"IF(VLOOKUP($D18,'Technische Daten'!$A:$L,10,0) <> \"\",1,0)","v":{"$error":"#N/A"}},{"$f":"IF(F18 = 1,VLOOKUP($D18,'Technische Daten'!$A:$L,3,0) / VLOOKUP($D18,'Technische Daten'!$A:$L,10,0) * (-1),0)","v":{"$error":"#N/A"}},null,null,{"$f":"VLOOKUP($D18,'Technische Daten'!$A:$L,5,0)","v":{"$error":"#N/A"}},{"$f":"IF($D18 <> \"\",VLOOKUP($D18,'Technische Daten'!$A:$L,4,0) - VLOOKUP($D18,'Technische Daten'!$A:$L,10,0) * H18 - I18,0)","v":0},"",{"$f":"IF(D18 <> \"\",IF(N17 <> 0,N17+N18,M16+N17+N18),\"\")","v":""},{"$f":"IF($D18 <> \"\",VLOOKUP($D18,'Technische Daten'!$A:$L,2,0),0)","v":0},{"$f":"IF(D16 <> \"\",1,0)","v":0}]
["EPM-S203",null,null,null,{"$f":"IF(D19<>\"\",VLOOKUP(D19,Texte!A$45:B$107,2,0),\"\")","v":""},null,null,null,null,null,{"$f":"IF($D19 <> \"\",VLOOKUP($D19,'Technische Daten'!$A:$L,3,0),0)","v":0},{"$f":"K19","v":0},{"$f":"IF(N19 = 0,M18,N19)","v":""},{"$f":"IF($D19 <> \"\",VLOOKUP($D19,'Technische Daten'!$A:$L,2,0),0)","v":0},{"$f":"IF(OR(L20 < 0,M20 < 0,D19 <> \"\",P20 <> 0),1,0)","v":0}]
["EPM-S204",{"$f":"Texte!$B$98","v":"Modulposition"},{"$f":"(ROW() - 4)/ 2","v":8},null,{"$f":"IF(D20<>\"\",VLOOKUP(D20,Texte!A$45:B$107,2,0),\"\")","v":""},{"$f":"IF(VLOOKUP($D20,'Technische Daten'!$A:$L,10,0) <> \"\",1,0)","v":{"$error":"#N/A"}},{"$f":"IF(F20 = 1,VLOOKUP($D20,'Technische Daten'!$A:$L,3,0) / VLOOKUP($D20,'Technische Daten'!$A:$L,10,0) * (-1),0)","v":{"$error":"#N/A"}},null,null,{"$f":"VLOOKUP($D20,'Technische Daten'!$A:$L,5,0)","v":{"$error":"#N/A"}},{"$f":"IF($D20 <> \"\",VLOOKUP($D20,'Technische Daten'!$A:$L,4,0) - VLOOKUP($D20,'Technische Daten'!$A:$L,10,0) * H20 - I20,0)","v":0},"",{"$f":"IF(D20 <> \"\",IF(N19 <> 0,N19+N20,M18+N19+N20),\"\")","v":""},{"$f":"IF($D20 <> \"\",VLOOKUP($D20,'Technische Daten'!$A:$L,2,0),0)","v":0},{"$f":"IF(D18 <> \"\",1,0)","v":0}]
["EPM-S205",null,null,null,{"$f":"IF(D21<>\"\",VLOOKUP(D21,Texte!A$45:B$107,2,0),\"\")","v":""},null,null,null,null,null,{"$f":"IF($D21 <> \"\",VLOOKUP($D21,'Technische Daten'!$A:$L,3,0),0)","v":0},{"$f":"K21","v":0},{"$f":"IF(N21 = 0,M20,N21)","v":""},{"$f":"IF($D21 <> \"\",VLOOKUP($D21,'Technische Daten'!$A:$L,2,0),0)","v":0},{"$f":"IF(OR(L22 < 0,M22 < 0,D21 <> \"\",P22 <> 0),1,0)","v":0}]
["EPM-S206",{"$f":"Texte!$B$98","v":"Modulposition"},{"$f":"(ROW() - 4)/ 2","v":9},null,{"$f":"IF(D22<>\"\",VLOOKUP(D22,Texte!A$45:B$107,2,0),\"\")","v":""},{"$f":"IF(VLOOKUP($D22,'Technische Daten'!$A:$L,10,0) <> \"\",1,0)","v":{"$error":"#N/A"}},{"$f":"IF(F22 = 1,VLOOKUP($D22,'Technische Daten'!$A:$L,3,0) / VLOOKUP($D22,'Technische Daten'!$A:$L,10,0) * (-1),0)","v":{"$error":"#N/A"}},null,null,{"$f":"VLOOKUP($D22,'Technische Daten'!$A:$L,5,0)","v":{"$error":"#N/A"}},{"$f":"IF($D22 <> \"\",VLOOKUP($D22,'Technische Daten'!$A:$L,4,0) - VLOOKUP($D22,'Technische Daten'!$A:$L,10,0) * H22 - I22,0)","v":0},"",{"$f":"IF(D22 <> \"\",IF(N21 <> 0,N21+N22,M20+N21+N22),\"\")","v":""},{"$f":"IF($D22 <> \"\",VLOOKUP($D22,'Technische Daten'!$A:$L,2,0),0)","v":0},{"$f":"IF(D20 <> \"\",1,0)","v":0}]
["EPM-S207",null,null,null,{"$f":"IF(D23<>\"\",VLOOKUP(D23,Texte!A$45:B$107,2,0),\"\")","v":""},null,null,null,null,null,{"$f":"IF($D23 <> \"\",VLOOKUP($D23,'Technische Daten'!$A:$L,3,0),0)","v":0},{"$f":"K23","v":0},{"$f":"IF(N23 = 0,M22,N23)","v":""},{"$f":"IF($D23 <> \"\",VLOOKUP($D23,'Technische Daten'!$A:$L,2,0),0)","v":0},{"$f":"IF(OR(L24 < 0,M24 < 0,D23 <> \"\",P24 <> 0),1,0)","v":0}]
["EPM-S300",{"$f":"Texte!$B$98","v":"Modulposition"},{"$f":"(ROW() - 4)/ 2","v":10},null,{"$f":"IF(D24<>\"\",VLOOKUP(D24,Texte!A$45:B$107,2,0),\"\")","v":""},{"$f":"IF(VLOOKUP($D24,'Technische Daten'!$A:$L,10,0) <> \"\",1,0)","v":{"$error":"#N/A"}},{"$f":"IF(F24 = 1,VLOOKUP($D24,'Technische Daten'!$A:$L,3,0) / VLOOKUP($D24,'Technische Daten'!$A:$L,10,0) * (-1),0)","v":{"$error":"#N/A"}},null,null,{"$f":"VLOOKUP($D24,'Technische Daten'!$A:$L,5,0)","v":{"$error":"#N/A"}},{"$f":"IF($D24 <> \"\",VLOOKUP($D24,'Technische Daten'!$A:$L,4,0) - VLOOKUP($D24,'Technische Daten'!$A:$L,10,0) * H24 - I24,0)","v":0},"",{"$f":"IF(D24 <> \"\",IF(N23 <> 0,N23+N24,M22+N23+N24),\"\")","v":""},{"$f":"IF($D24 <> \"\",VLOOKUP($D24,'Technische Daten'!$A:$L,2,0),0)","v":0},{"$f":"IF(D22 <> \"\",1,0)","v":0}]
["EPM-S301",null,null,null,{"$f":"IF(D25<>\"\",VLOOKUP(D25,Texte!A$45:B$107,2,0),\"\")","v":""},null,null,null,null,null,{"$f":"IF($D25 <> \"\",VLOOKUP($D25,'Technische Daten'!$A:$L,3,0),0)","v":0},{"$f":"K25","v":0},{"$f":"IF(N25 = 0,M24,N25)","v":""},{"$f":"IF($D25 <> \"\",VLOOKUP($D25,'Technische Daten'!$A:$L,2,0),0)","v":0},{"$f":"IF(OR(L26 < 0,M26 < 0,D25 <> \"\",P26 <> 0),1,0)","v":0}]
["EPM-S302",{"$f":"Texte!$B$98","v":"Modulposition"},{"$f":"(ROW() - 4)/ 2","v":11},null,{"$f":"IF(D26<>\"\",VLOOKUP(D26,Texte!A$45:B$107,2,0),\"\")","v":""},{"$f":"IF(VLOOKUP($D26,'Technische Daten'!$A:$L,10,0) <> \"\",1,0)","v":{"$error":"#N/A"}},{"$f":"IF(F26 = 1,VLOOKUP($D26,'Technische Daten'!$A:$L,3,0) / VLOOKUP($D26,'Technische Daten'!$A:$L,10,0) * (-1),0)","v":{"$error":"#N/A"}},null,null,{"$f":"VLOOKUP($D26,'Technische Daten'!$A:$L,5,0)","v":{"$error":"#N/A"}},{"$f":"IF($D26 <> \"\",VLOOKUP($D26,'Technische Daten'!$A:$L,4,0) - VLOOKUP($D26,'Technische Daten'!$A:$L,10,0) * H26 - I26,0)","v":0},"",{"$f":"IF(D26 <> \"\",IF(N25 <> 0,N25+N26,M24+N25+N26),\"\")","v":""},{"$f":"IF($D26 <> \"\",VLOOKUP($D26,'Technische Daten'!$A:$L,2,0),0)","v":0},{"$f":"IF(D24 <> \"\",1,0)","v":0}]
["EPM-S303",null,null,null,{"$f":"IF(D27<>\"\",VLOOKUP(D27,Texte!A$45:B$107,2,0),\"\")","v":""},null,null,null,null,null,{"$f":"IF($D27 <> \"\",VLOOKUP($D27,'Technische Daten'!$A:$L,3,0),0)","v":0},{"$f":"K27","v":0},{"$f":"IF(N27 = 0,M26,N27)","v":""},{"$f":"IF($D27 <> \"\",VLOOKUP($D27,'Technische Daten'!$A:$L,2,0),0)","v":0},{"$f":"IF(OR(L28 < 0,M28 < 0,D27 <> \"\",P28 <> 0),1,0)","v":0}]
["EPM-S304",{"$f":"Texte!$B$98","v":"Modulposition"},{"$f":"(ROW() - 4)/ 2","v":12},null,{"$f":"IF(D28<>\"\",VLOOKUP(D28,Texte!A$45:B$107,2,0),\"\")","v":""},{"$f":"IF(VLOOKUP($D28,'Technische Daten'!$A:$L,10,0) <> \"\",1,0)","v":{"$error":"#N/A"}},{"$f":"IF(F28 = 1,VLOOKUP($D28,'Technische Daten'!$A:$L,3,0) / VLOOKUP($D28,'Technische Daten'!$A:$L,10,0) * (-1),0)","v":{"$error":"#N/A"}},null,null,{"$f":"VLOOKUP($D28,'Technische Daten'!$A:$L,5,0)","v":{"$error":"#N/A"}},{"$f":"IF($D28 <> \"\",VLOOKUP($D28,'Technische Daten'!$A:$L,4,0) - VLOOKUP($D28,'Technische Daten'!$A:$L,10,0) * H28 - I28,0)","v":0},"",{"$f":"IF(D28 <> \"\",IF(N27 <> 0,N27+N28,M26+N27+N28),\"\")","v":""},{"$f":"IF($D28 <> \"\",VLOOKUP($D28,'Technische Daten'!$A:$L,2,0),0)","v":0},{"$f":"IF(D26 <> \"\",1,0)","v":0}]
["EPM-S305",null,null,null,{"$f":"IF(D29<>\"\",VLOOKUP(D29,Texte!A$45:B$107,2,0),\"\")","v":""},null,null,null,null,null,{"$f":"IF($D29 <> \"\",VLOOKUP($D29,'Technische Daten'!$A:$L,3,0),0)","v":0},{"$f":"K29","v":0},{"$f":"IF(N29 = 0,M28,N29)","v":""},{"$f":"IF($D29 <> \"\",VLOOKUP($D29,'Technische Daten'!$A:$L,2,0),0)","v":0},{"$f":"IF(OR(L30 < 0,M30 < 0,D29 <> \"\",P30 <> 0),1,0)","v":0}]
["EPM-S306",{"$f":"Texte!$B$98","v":"Modulposition"},{"$f":"(ROW() - 4)/ 2","v":13},null,{"$f":"IF(D30<>\"\",VLOOKUP(D30,Texte!A$45:B$107,2,0),\"\")","v":""},{"$f":"IF(VLOOKUP($D30,'Technische Daten'!$A:$L,10,0) <> \"\",1,0)","v":{"$error":"#N/A"}},{"$f":"IF(F30 = 1,VLOOKUP($D30,'Technische Daten'!$A:$L,3,0) / VLOOKUP($D30,'Technische Daten'!$A:$L,10,0) * (-1),0)","v":{"$error":"#N/A"}},null,null,{"$f":"VLOOKUP($D30,'Technische Daten'!$A:$L,5,0)","v":{"$error":"#N/A"}},{"$f":"IF($D30 <> \"\",VLOOKUP($D30,'Technische Daten'!$A:$L,4,0) - VLOOKUP($D30,'Technische Daten'!$A:$L,10,0) * H30 - I30,0)","v":0},"",{"$f":"IF(D30 <> \"\",IF(N29 <> 0,N29+N30,M28+N29+N30),\"\")","v":""},{"$f":"IF($D30 <> \"\",VLOOKUP($D30,'Technische Daten'!$A:$L,2,0),0)","v":0},{"$f":"IF(D28 <> \"\",1,0)","v":0}]
["EPM-S308",null,null,null,{"$f":"IF(D31<>\"\",VLOOKUP(D31,Texte!A$45:B$107,2,0),\"\")","v":""},null,null,null,null,null,{"$f":"IF($D31 <> \"\",VLOOKUP($D31,'Technische Daten'!$A:$L,3,0),0)","v":0},{"$f":"K31","v":0},{"$f":"IF(N31 = 0,M30,N31)","v":""},{"$f":"IF($D31 <> \"\",VLOOKUP($D31,'Technische Daten'!$A:$L,2,0),0)","v":0},{"$f":"IF(OR(L32 < 0,M32 < 0,D31 <> \"\",P32 <> 0),1,0)","v":0}]
["EPM-S309",{"$f":"Texte!$B$98","v":"Modulposition"},{"$f":"(ROW() - 4)/ 2","v":14},null,{"$f":"IF(D32<>\"\",VLOOKUP(D32,Texte!A$45:B$107,2,0),\"\")","v":""},{"$f":"IF(VLOOKUP($D32,'Technische Daten'!$A:$L,10,0) <> \"\",1,0)","v":{"$error":"#N/A"}},{"$f":"IF(F32 = 1,VLOOKUP($D32,'Technische Daten'!$A:$L,3,0) / VLOOKUP($D32,'Technische Daten'!$A:$L,10,0) * (-1),0)","v":{"$error":"#N/A"}},null,null,{"$f":"VLOOKUP($D32,'Technische Daten'!$A:$L,5,0)","v":{"$error":"#N/A"}},{"$f":"IF($D32 <> \"\",VLOOKUP($D32,'Technische Daten'!$A:$L,4,0) - VLOOKUP($D32,'Technische Daten'!$A:$L,10,0) * H32 - I32,0)","v":0},"",{"$f":"IF(D32 <> \"\",IF(N31 <> 0,N31+N32,M30+N31+N32),\"\")","v":""},{"$f":"IF($D32 <> \"\",VLOOKUP($D32,'Technische Daten'!$A:$L,2,0),0)","v":0},{"$f":"IF(D30 <> \"\",1,0)","v":0}]
["EPM-S310",null,null,null,{"$f":"IF(D33<>\"\",VLOOKUP(D33,Texte!A$45:B$107,2,0),\"\")","v":""},null,null,null,null,null,{"$f":"IF($D33 <> \"\",VLOOKUP($D33,'Technische Daten'!$A:$L,3,0),0)","v":0},{"$f":"K33","v":0},{"$f":"IF(N33 = 0,M32,N33)","v":""},{"$f":"IF($D33 <> \"\",VLOOKUP($D33,'Technische Daten'!$A:$L,2,0),0)","v":0},{"$f":"IF(OR(L34 < 0,M34 < 0,D33 <> \"\",P34 <> 0),1,0)","v":0}]
["EPM-S400",{"$f":"Texte!$B$98","v":"Modulposition"},{"$f":"(ROW() - 4)/ 2","v":15},null,{"$f":"IF(D34<>\"\",VLOOKUP(D34,Texte!A$45:B$107,2,0),\"\")","v":""},{"$f":"IF(VLOOKUP($D34,'Technische Daten'!$A:$L,10,0) <> \"\",1,0)","v":{"$error":"#N/A"}},{"$f":"IF(F34 = 1,VLOOKUP($D34,'Technische Daten'!$A:$L,3,0) / VLOOKUP($D34,'Technische Daten'!$A:$L,10,0) * (-1),0)","v":{"$error":"#N/A"}},null,null,{"$f":"VLOOKUP($D34,'Technische Daten'!$A:$L,5,0)","v":{"$error":"#N/A"}},{"$f":"IF($D34 <> \"\",VLOOKUP($D34,'Technische Daten'!$A:$L,4,0) - VLOOKUP($D34,'Technische Daten'!$A:$L,10,0) * H34 - I34,0)","v":0},"",{"$f":"IF(D34 <> \"\",IF(N33 <> 0,N33+N34,M32+N33+N34),\"\")","v":""},{"$f":"IF($D34 <> \"\",VLOOKUP($D34,'Technische Daten'!$A:$L,2,0),0)","v":0},{"$f":"IF(D32 <> \"\",1,0)","v":0}]
["EPM-S401",null,null,null,{"$f":"IF(D35<>\"\",VLOOKUP(D35,Texte!A$45:B$107,2,0),\"\")","v":""},null,null,null,null,null,{"$f":"IF($D35 <> \"\",VLOOKUP($D35,'Technische Daten'!$A:$L,3,0),0)","v":0},{"$f":"K35","v":0},{"$f":"IF(N35 = 0,M34,N35)","v":""},{"$f":"IF($D35 <> \"\",VLOOKUP($D35,'Technische Daten'!$A:$L,2,0),0)","v":0},{"$f":"IF(OR(L36 < 0,M36 < 0,D35 <> \"\",P36 <> 0),1,0)","v":0}]
["EPM-S402",{"$f":"Texte!$B$98","v":"Modulposition"},{"$f":"(ROW() - 4)/ 2","v":16},null,{"$f":"IF(D36<>\"\",VLOOKUP(D36,Texte!A$45:B$107,2,0),\"\")","v":""},{"$f":"IF(VLOOKUP($D36,'Technische Daten'!$A:$L,10,0) <> \"\",1,0)","v":{"$error":"#N/A"}},{"$f":"IF(F36 = 1,VLOOKUP($D36,'Technische Daten'!$A:$L,3,0) / VLOOKUP($D36,'Technische Daten'!$A:$L,10,0) * (-1),0)","v":{"$error":"#N/A"}},null,null,{"$f":"VLOOKUP($D36,'Technische Daten'!$A:$L,5,0)","v":{"$error":"#N/A"}},{"$f":"IF($D36 <> \"\",VLOOKUP($D36,'Technische Daten'!$A:$L,4,0) - VLOOKUP($D36,'Technische Daten'!$A:$L,10,0) * H36 - I36,0)","v":0},"",{"$f":"IF(D36 <> \"\",IF(N35 <> 0,N35+N36,M34+N35+N36),\"\")","v":""},{"$f":"IF($D36 <> \"\",VLOOKUP($D36,'Technische Daten'!$A:$L,2,0),0)","v":0},{"$f":"IF(D34 <> \"\",1,0)","v":0}]
["EPM-S403",null,null,null,{"$f":"IF(D37<>\"\",VLOOKUP(D37,Texte!A$45:B$107,2,0),\"\")","v":""},null,null,null,null,null,{"$f":"IF($D37 <> \"\",VLOOKUP($D37,'Technische Daten'!$A:$L,3,0),0)","v":0},{"$f":"K37","v":0},{"$f":"IF(N37 = 0,M36,N37)","v":""},{"$f":"IF($D37 <> \"\",VLOOKUP($D37,'Technische Daten'!$A:$L,2,0),0)","v":0},{"$f":"IF(OR(L38 < 0,M38 < 0,D37 <> \"\",P38 <> 0),1,0)","v":0}]
["EPM-S404",{"$f":"Texte!$B$98","v":"Modulposition"},{"$f":"(ROW() - 4)/ 2","v":17},null,{"$f":"IF(D38<>\"\",VLOOKUP(D38,Texte!A$45:B$107,2,0),\"\")","v":""},{"$f":"IF(VLOOKUP($D38,'Technische Daten'!$A:$L,10,0) <> \"\",1,0)","v":{"$error":"#N/A"}},{"$f":"IF(F38 = 1,VLOOKUP($D38,'Technische Daten'!$A:$L,3,0) / VLOOKUP($D38,'Technische Daten'!$A:$L,10,0) * (-1),0)","v":{"$error":"#N/A"}},null,null,{"$f":"VLOOKUP($D38,'Technische Daten'!$A:$L,5,0)","v":{"$error":"#N/A"}},{"$f":"IF($D38 <> \"\",VLOOKUP($D38,'Technische Daten'!$A:$L,4,0) - VLOOKUP($D38,'Technische Daten'!$A:$L,10,0) * H38 - I38,0)","v":0},"",{"$f":"IF(D38 <> \"\",IF(N37 <> 0,N37+N38,M36+N37+N38),\"\")","v":""},{"$f":"IF($D38 <> \"\",VLOOKUP($D38,'Technische Daten'!$A:$L,2,0),0)","v":0},{"$f":"IF(D36 <> \"\",1,0)","v":0}]
["EPM-S405",null,null,null,{"$f":"IF(D39<>\"\",VLOOKUP(D39,Texte!A$45:B$107,2,0),\"\")","v":""},null,null,null,null,null,{"$f":"IF($D39 <> \"\",VLOOKUP($D39,'Technische Daten'!$A:$L,3,0),0)","v":0},{"$f":"K39","v":0},{"$f":"IF(N39 = 0,M38,N39)","v":""},{"$f":"IF($D39 <> \"\",VLOOKUP($D39,'Technische Daten'!$A:$L,2,0),0)","v":0},{"$f":"IF(OR(L40 < 0,M40 < 0,D39 <> \"\",P40 <> 0),1,0)","v":0}]
["EPM-S406",{"$f":"Texte!$B$98","v":"Modulposition"},{"$f":"(ROW() - 4)/ 2","v":18},null,{"$f":"IF(D40<>\"\",VLOOKUP(D40,Texte!A$45:B$107,2,0),\"\")","v":""},{"$f":"IF(VLOOKUP($D40,'Technische Daten'!$A:$L,10,0) <> \"\",1,0)","v":{"$error":"#N/A"}},{"$f":"IF(F40 = 1,VLOOKUP($D40,'Technische Daten'!$A:$L,3,0) / VLOOKUP($D40,'Technische Daten'!$A:$L,10,0) * (-1),0)","v":{"$error":"#N/A"}},null,null,{"$f":"VLOOKUP($D40,'Technische Daten'!$A:$L,5,0)","v":{"$error":"#N/A"}},{"$f":"IF($D40 <> \"\",VLOOKUP($D40,'Technische Daten'!$A:$L,4,0) - VLOOKUP($D40,'Technische Daten'!$A:$L,10,0) * H40 - I40,0)","v":0},"",{"$f":"IF(D40 <> \"\",IF(N39 <> 0,N39+N40,M38+N39+N40),\"\")","v":""},{"$f":"IF($D40 <> \"\",VLOOKUP($D40,'Technische Daten'!$A:$L,2,0),0)","v":0},{"$f":"IF(D38 <> \"\",1,0)","v":0}]
["EPM-S408",null,null,null,{"$f":"IF(D41<>\"\",VLOOKUP(D41,Texte!A$45:B$107,2,0),\"\")","v":""},null,null,null,null,null,{"$f":"IF($D41 <> \"\",VLOOKUP($D41,'Technische Daten'!$A:$L,3,0),0)","v":0},{"$f":"K41","v":0},{"$f":"IF(N41 = 0,M40,N41)","v":""},{"$f":"IF($D41 <> \"\",VLOOKUP($D41,'Technische Daten'!$A:$L,2,0),0)","v":0},{"$f":"IF(OR(L42 < 0,M42 < 0,D41 <> \"\",P42 <> 0),1,0)","v":0}]
["EPM-S500",{"$f":"Texte!$B$98","v":"Modulposition"},{"$f":"(ROW() - 4)/ 2","v":19},null,{"$f":"IF(D42<>\"\",VLOOKUP(D42,Texte!A$45:B$107,2,0),\"\")","v":""},{"$f":"IF(VLOOKUP($D42,'Technische Daten'!$A:$L,10,0) <> \"\",1,0)","v":{"$error":"#N/A"}},{"$f":"IF(F42 = 1,VLOOKUP($D42,'Technische Daten'!$A:$L,3,0) / VLOOKUP($D42,'Technische Daten'!$A:$L,10,0) * (-1),0)","v":{"$error":"#N/A"}},null,null,{"$f":"VLOOKUP($D42,'Technische Daten'!$A:$L,5,0)","v":{"$error":"#N/A"}},{"$f":"IF($D42 <> \"\",VLOOKUP($D42,'Technische Daten'!$A:$L,4,0) - VLOOKUP($D42,'Technische Daten'!$A:$L,10,0) * H42 - I42,0)","v":0},"",{"$f":"IF(D42 <> \"\",IF(N41 <> 0,N41+N42,M40+N41+N42),\"\")","v":""},{"$f":"IF($D42 <> \"\",VLOOKUP($D42,'Technische Daten'!$A:$L,2,0),0)","v":0},{"$f":"IF(D40 <> \"\",1,0)","v":0}]
["EPM-S501",null,null,null,{"$f":"IF(D43<>\"\",VLOOKUP(D43,Texte!A$45:B$107,2,0),\"\")","v":""},null,null,null,null,null,{"$f":"IF($D43 <> \"\",VLOOKUP($D43,'Technische Daten'!$A:$L,3,0),0)","v":0},{"$f":"K43","v":0},{"$f":"IF(N43 = 0,M42,N43)","v":""},{"$f":"IF($D43 <> \"\",VLOOKUP($D43,'Technische Daten'!$A:$L,2,0),0)","v":0},{"$f":"IF(OR(L44 < 0,M44 < 0,D43 <> \"\",P44 <> 0),1,0)","v":0}]
["EPM-S502",{"$f":"Texte!$B$98","v":"Modulposition"},{"$f":"(ROW() - 4)/ 2","v":20},null,{"$f":"IF(D44<>\"\",VLOOKUP(D44,Texte!A$45:B$107,2,0),\"\")","v":""},{"$f":"IF(VLOOKUP($D44,'Technische Daten'!$A:$L,10,0) <> \"\",1,0)","v":{"$error":"#N/A"}},{"$f":"IF(F44 = 1,VLOOKUP($D44,'Technische Daten'!$A:$L,3,0) / VLOOKUP($D44,'Technische Daten'!$A:$L,10,0) * (-1),0)","v":{"$error":"#N/A"}},null,null,{"$f":"VLOOKUP($D44,'Technische Daten'!$A:$L,5,0)","v":{"$error":"#N/A"}},{"$f":"IF($D44 <> \"\",VLOOKUP($D44,'Technische Daten'!$A:$L,4,0) - VLOOKUP($D44,'Technische Daten'!$A:$L,10,0) * H44 - I44,0)","v":0},"",{"$f":"IF(D44 <> \"\",IF(N43 <> 0,N43+N44,M42+N43+N44),\"\")","v":""},{"$f":"IF($D44 <> \"\",VLOOKUP($D44,'Technische Daten'!$A:$L,2,0),0)","v":0},{"$f":"IF(D42 <> \"\",1,0)","v":0}]
["EPM-S503",null,null,null,{"$f":"IF(D45<>\"\",VLOOKUP(D45,Texte!A$45:B$107,2,0),\"\")","v":""},null,null,null,null,null,{"$f":"IF($D45 <> \"\",VLOOKUP($D45,'Technische Daten'!$A:$L,3,0),0)","v":0},{"$f":"K45","v":0},{"$f":"IF(N45 = 0,M44,N45)","v":""},{"$f":"IF($D45 <> \"\",VLOOKUP($D45,'Technische Daten'!$A:$L,2,0),0)","v":0},{"$f":"IF(OR(L46 < 0,M46 < 0,D45 <> \"\",P46 <> 0),1,0)","v":0}]
["EPM-S600",{"$f":"Texte!$B$98","v":"Modulposition"},{"$f":"(ROW() - 4)/ 2","v":21},null,{"$f":"IF(D46<>\"\",VLOOKUP(D46,Texte!A$45:B$107,2,0),\"\")","v":""},{"$f":"IF(VLOOKUP($D46,'Technische Daten'!$A:$L,10,0) <> \"\",1,0)","v":{"$error":"#N/A"}},{"$f":"IF(F46 = 1,VLOOKUP($D46,'Technische Daten'!$A:$L,3,0) / VLOOKUP($D46,'Technische Daten'!$A:$L,10,0) * (-1),0)","v":{"$error":"#N/A"}},null,null,{"$f":"VLOOKUP($D46,'Technische Daten'!$A:$L,5,0)","v":{"$error":"#N/A"}},{"$f":"IF($D46 <> \"\",VLOOKUP($D46,'Technische Daten'!$A:$L,4,0) - VLOOKUP($D46,'Technische Daten'!$A:$L,10,0) * H46 - I46,0)","v":0},"",{"$f":"IF(D46 <> \"\",IF(N45 <> 0,N45+N46,M44+N45+N46),\"\")","v":""},{"$f":"IF($D46 <> \"\",VLOOKUP($D46,'Technische Daten'!$A:$L,2,0),0)","v":0},{"$f":"IF(D44 <> \"\",1,0)","v":0}]
["EPM-S601",null,null,null,{"$f":"IF(D47<>\"\",VLOOKUP(D47,Texte!A$45:B$107,2,0),\"\")","v":""},null,null,null,null,null,{"$f":"IF($D47 <> \"\",VLOOKUP($D47,'Technische Daten'!$A:$L,3,0),0)","v":0},{"$f":"K47","v":0},{"$f":"IF(N47 = 0,M46,N47)","v":""},{"$f":"IF($D47 <> \"\",VLOOKUP($D47,'Technische Daten'!$A:$L,2,0),0)","v":0},{"$f":"IF(OR(L48 < 0,M48 < 0,D47 <> \"\",P48 <> 0),1,0)","v":0}]
["EPM-S602",{"$f":"Texte!$B$98","v":"Modulposition"},{"$f":"(ROW() - 4)/ 2","v":22},null,{"$f":"IF(D48<>\"\",VLOOKUP(D48,Texte!A$45:B$107,2,0),\"\")","v":""},{"$f":"IF(VLOOKUP($D48,'Technische Daten'!$A:$L,10,0) <> \"\",1,0)","v":{"$error":"#N/A"}},{"$f":"IF(F48 = 1,VLOOKUP($D48,'Technische Daten'!$A:$L,3,0) / VLOOKUP($D48,'Technische Daten'!$A:$L,10,0) * (-1),0)","v":{"$error":"#N/A"}},null,null,{"$f":"VLOOKUP($D48,'Technische Daten'!$A:$L,5,0)","v":{"$error":"#N/A"}},{"$f":"IF($D48 <> \"\",VLOOKUP($D48,'Technische Daten'!$A:$L,4,0) - VLOOKUP($D48,'Technische Daten'!$A:$L,10,0) * H48 - I48,0)","v":0},"",{"$f":"IF(D48 <> \"\",IF(N47 <> 0,N47+N48,M46+N47+N48),\"\")","v":""},{"$f":"IF($D48 <> \"\",VLOOKUP($D48,'Technische Daten'!$A:$L,2,0),0)","v":0},{"$f":"IF(D46 <> \"\",1,0)","v":0}]
["EPM-S603",null,null,null,{"$f":"IF(D49<>\"\",VLOOKUP(D49,Texte!A$45:B$107,2,0),\"\")","v":""},null,null,null,null,null,{"$f":"IF($D49 <> \"\",VLOOKUP($D49,'Technische Daten'!$A:$L,3,0),0)","v":0},{"$f":"K49","v":0},{"$f":"IF(N49 = 0,M48,N49)","v":""},{"$f":"IF($D49 <> \"\",VLOOKUP($D49,'Technische Daten'!$A:$L,2,0),0)","v":0},{"$f":"IF(OR(L50 < 0,M50 < 0,D49 <> \"\",P50 <> 0),1,0)","v":0}]
["EPM-S604",{"$f":"Texte!$B$98","v":"Modulposition"},{"$f":"(ROW() - 4)/ 2","v":23},null,{"$f":"IF(D50<>\"\",VLOOKUP(D50,Texte!A$45:B$107,2,0),\"\")","v":""},{"$f":"IF(VLOOKUP($D50,'Technische Daten'!$A:$L,10,0) <> \"\",1,0)","v":{"$error":"#N/A"}},{"$f":"IF(F50 = 1,VLOOKUP($D50,'Technische Daten'!$A:$L,3,0) / VLOOKUP($D50,'Technische Daten'!$A:$L,10,0) * (-1),0)","v":{"$error":"#N/A"}},null,null,{"$f":"VLOOKUP($D50,'Technische Daten'!$A:$L,5,0)","v":{"$error":"#N/A"}},{"$f":"IF($D50 <> \"\",VLOOKUP($D50,'Technische Daten'!$A:$L,4,0) - VLOOKUP($D50,'Technische Daten'!$A:$L,10,0) * H50 - I50,0)","v":0},"",{"$f":"IF(D50 <> \"\",IF(N49 <> 0,N49+N50,M48+N49+N50),\"\")","v":""},{"$f":"IF($D50 <> \"\",VLOOKUP($D50,'Technische Daten'!$A:$L,2,0),0)","v":0},{"$f":"IF(D48 <> \"\",1,0)","v":0}]
["EPM-S620",null,null,null,{"$f":"IF(D51<>\"\",VLOOKUP(D51,Texte!A$45:B$107,2,0),\"\")","v":""},null,null,null,null,null,{"$f":"IF($D51 <> \"\",VLOOKUP($D51,'Technische Daten'!$A:$L,3,0),0)","v":0},{"$f":"K51","v":0},{"$f":"IF(N51 = 0,M50,N51)","v":""},{"$f":"IF($D51 <> \"\",VLOOKUP($D51,'Technische Daten'!$A:$L,2,0),0)","v":0},{"$f":"IF(OR(L52 < 0,M52 < 0,D51 <> \"\",P52 <> 0),1,0)","v":0}]
["EPM-S640",{"$f":"Texte!$B$98","v":"Modulposition"},{"$f":"(ROW() - 4)/ 2","v":24},null,{"$f":"IF(D52<>\"\",VLOOKUP(D52,Texte!A$45:B$107,2,0),\"\")","v":""},{"$f":"IF(VLOOKUP($D52,'Technische Daten'!$A:$L,10,0) <> \"\",1,0)","v":{"$error":"#N/A"}},{"$f":"IF(F52 = 1,VLOOKUP($D52,'Technische Daten'!$A:$L,3,0) / VLOOKUP($D52,'Technische Daten'!$A:$L,10,0) * (-1),0)","v":{"$error":"#N/A"}},null,null,{"$f":"VLOOKUP($D52,'Technische Daten'!$A:$L,5,0)","v":{"$error":"#N/A"}},{"$f":"IF($D52 <> \"\",VLOOKUP($D52,'Technische Daten'!$A:$L,4,0) - VLOOKUP($D52,'Technische Daten'!$A:$L,10,0) * H52 - I52,0)","v":0},"",{"$f":"IF(D52 <> \"\",IF(N51 <> 0,N51+N52,M50+N51+N52),\"\")","v":""},{"$f":"IF($D52 <> \"\",VLOOKUP($D52,'Technische Daten'!$A:$L,2,0),0)","v":0},{"$f":"IF(D50 <> \"\",1,0)","v":0}]
["EPM-S650",null,null,null,{"$f":"IF(D53<>\"\",VLOOKUP(D53,Texte!A$45:B$107,2,0),\"\")","v":""},null,null,null,null,null,{"$f":"IF($D53 <> \"\",VLOOKUP($D53,'Technische Daten'!$A:$L,3,0),0)","v":0},{"$f":"K53","v":0},{"$f":"IF(N53 = 0,M52,N53)","v":""},{"$f":"IF($D53 <> \"\",VLOOKUP($D53,'Technische Daten'!$A:$L,2,0),0)","v":0},{"$f":"IF(OR(L54 < 0,M54 < 0,D53 <> \"\",P54 <> 0),1,0)","v":0}]
["EPM-S603",{"$f":"Texte!$B$98","v":"Modulposition"},{"$f":"(ROW() - 4)/ 2","v":25},null,{"$f":"IF(D54<>\"\",VLOOKUP(D54,Texte!A$45:B$107,2,0),\"\")","v":""},{"$f":"IF(VLOOKUP($D54,'Technische Daten'!$A:$L,10,0) <> \"\",1,0)","v":{"$error":"#N/A"}},{"$f":"IF(F54 = 1,VLOOKUP($D54,'Technische Daten'!$A:$L,3,0) / VLOOKUP($D54,'Technische Daten'!$A:$L,10,0) * (-1),0)","v":{"$error":"#N/A"}},null,null,{"$f":"VLOOKUP($D54,'Technische Daten'!$A:$L,5,0)","v":{"$error":"#N/A"}},{"$f":"IF($D54 <> \"\",VLOOKUP($D54,'Technische Daten'!$A:$L,4,0) - VLOOKUP($D54,'Technische Daten'!$A:$L,10,0) * H54 - I54,0)","v":0},"",{"$f":"IF(D54 <> \"\",IF(N53 <> 0,N53+N54,M52+N53+N54),\"\")","v":""},{"$f":"IF($D54 <> \"\",VLOOKUP($D54,'Technische Daten'!$A:$L,2,0),0)","v":0},{"$f":"IF(D52 <> \"\",1,0)","v":0}]
["EPM-S701",null,null,null,{"$f":"IF(D55<>\"\",VLOOKUP(D55,Texte!A$45:B$107,2,0),\"\")","v":""},null,null,null,null,null,{"$f":"IF($D55 <> \"\",VLOOKUP($D55,'Technische Daten'!$A:$L,3,0),0)","v":0},{"$f":"K55","v":0},{"$f":"IF(N55 = 0,M54,N55)","v":""},{"$f":"IF($D55 <> \"\",VLOOKUP($D55,'Technische Daten'!$A:$L,2,0),0)","v":0},{"$f":"IF(OR(L56 < 0,M56 < 0,D55 <> \"\",P56 <> 0),1,0)","v":0}]
["EPM-S702",{"$f":"Texte!$B$98","v":"Modulposition"},{"$f":"(ROW() - 4)/ 2","v":26},null,{"$f":"IF(D56<>\"\",VLOOKUP(D56,Texte!A$45:B$107,2,0),\"\")","v":""},{"$f":"IF(VLOOKUP($D56,'Technische Daten'!$A:$L,10,0) <> \"\",1,0)","v":{"$error":"#N/A"}},{"$f":"IF(F56 = 1,VLOOKUP($D56,'Technische Daten'!$A:$L,3,0) / VLOOKUP($D56,'Technische Daten'!$A:$L,10,0) * (-1),0)","v":{"$error":"#N/A"}},null,null,{"$f":"VLOOKUP($D56,'Technische Daten'!$A:$L,5,0)","v":{"$error":"#N/A"}},{"$f":"IF($D56 <> \"\",VLOOKUP($D56,'Technische Daten'!$A:$L,4,0) - VLOOKUP($D56,'Technische Daten'!$A:$L,10,0) * H56 - I56,0)","v":0},"",{"$f":"IF(D56 <> \"\",IF(N55 <> 0,N55+N56,M54+N55+N56),\"\")","v":""},{"$f":"IF($D56 <> \"\",VLOOKUP($D56,'Technische Daten'!$A:$L,2,0),0)","v":0},{"$f":"IF(D54 <> \"\",1,0)","v":0}]
[null,null,null,null,{"$f":"IF(D57<>\"\",VLOOKUP(D57,Texte!A$45:B$107,2,0),\"\")","v":""},null,null,null,null,null,{"$f":"IF($D57 <> \"\",VLOOKUP($D57,'Technische Daten'!$A:$L,3,0),0)","v":0},{"$f":"K57","v":0},{"$f":"IF(N57 = 0,M56,N57)","v":""},{"$f":"IF($D57 <> \"\",VLOOKUP($D57,'Technische Daten'!$A:$L,2,0),0)","v":0},{"$f":"IF(OR(L58 < 0,M58 < 0,D57 <> \"\",P58 <> 0),1,0)","v":0}]
[null,{"$f":"Texte!$B$98","v":"Modulposition"},{"$f":"(ROW() - 4)/ 2","v":27},null,{"$f":"IF(D58<>\"\",VLOOKUP(D58,Texte!A$45:B$107,2,0),\"\")","v":""},{"$f":"IF(VLOOKUP($D58,'Technische Daten'!$A:$L,10,0) <> \"\",1,0)","v":{"$error":"#N/A"}},{"$f":"IF(F58 = 1,VLOOKUP($D58,'Technische Daten'!$A:$L,3,0) / VLOOKUP($D58,'Technische Daten'!$A:$L,10,0) * (-1),0)","v":{"$error":"#N/A"}},null,null,{"$f":"VLOOKUP($D58,'Technische Daten'!$A:$L,5,0)","v":{"$error":"#N/A"}},{"$f":"IF($D58 <> \"\",VLOOKUP($D58,'Technische Daten'!$A:$L,4,0) - VLOOKUP($D58,'Technische Daten'!$A:$L,10,0) * H58 - I58,0)","v":0},"",{"$f":"IF(D58 <> \"\",IF(N57 <> 0,N57+N58,M56+N57+N58),\"\")","v":""},{"$f":"IF($D58 <> \"\",VLOOKUP($D58,'Technische Daten'!$A:$L,2,0),0)","v":0},{"$f":"IF(D56 <> \"\",1,0)","v":0}]
[null,null,null,null,{"$f":"IF(D59<>\"\",VLOOKUP(D59,Texte!A$45:B$107,2,0),\"\")","v":""},null,null,null,null,null,{"$f":"IF($D59 <> \"\",VLOOKUP($D59,'Technische Daten'!$A:$L,3,0),0)","v":0},{"$f":"K59","v":0},{"$f":"IF(N59 = 0,M58,N59)","v":""},{"$f":"IF($D59 <> \"\",VLOOKUP($D59,'Technische Daten'!$A:$L,2,0),0)","v":0},{"$f":"IF(OR(L60 < 0,M60 < 0,D59 <> \"\",P60 <> 0),1,0)","v":0}]
[null,{"$f":"Texte!$B$98","v":"Modulposition"},{"$f":"(ROW() - 4)/ 2","v":28},null,{"$f":"IF(D60<>\"\",VLOOKUP(D60,Texte!A$45:B$107,2,0),\"\")","v":""},{"$f":"IF(VLOOKUP($D60,'Technische Daten'!$A:$L,10,0) <> \"\",1,0)","v":{"$error":"#N/A"}},{"$f":"IF(F60 = 1,VLOOKUP($D60,'Technische Daten'!$A:$L,3,0) / VLOOKUP($D60,'Technische Daten'!$A:$L,10,0) * (-1),0)","v":{"$error":"#N/A"}},null,null,{"$f":"VLOOKUP($D60,'Technische Daten'!$A:$L,5,0)","v":{"$error":"#N/A"}},{"$f":"IF($D60 <> \"\",VLOOKUP($D60,'Technische Daten'!$A:$L,4,0) - VLOOKUP($D60,'Technische Daten'!$A:$L,10,0) * H60 - I60,0)","v":0},"",{"$f":"IF(D60 <> \"\",IF(N59 <> 0,N59+N60,M58+N59+N60),\"\")","v":""},{"$f":"IF($D60 <> \"\",VLOOKUP($D60,'Technische Daten'!$A:$L,2,0),0)","v":0},{"$f":"IF(D58 <> \"\",1,0)","v":0}]
[null,null,null,null,{"$f":"IF(D61<>\"\",VLOOKUP(D61,Texte!A$45:B$107,2,0),\"\")","v":""},null,null,null,null,null,{"$f":"IF($D61 <> \"\",VLOOKUP($D61,'Technische Daten'!$A:$L,3,0),0)","v":0},{"$f":"K61","v":0},{"$f":"IF(N61 = 0,M60,N61)","v":""},{"$f":"IF($D61 <> \"\",VLOOKUP($D61,'Technische Daten'!$A:$L,2,0),0)","v":0},{"$f":"IF(OR(L62 < 0,M62 < 0,D61 <> \"\",P62 <> 0),1,0)","v":0}]
[null,{"$f":"Texte!$B$98","v":"Modulposition"},{"$f":"(ROW() - 4)/ 2","v":29},null,{"$f":"IF(D62<>\"\",VLOOKUP(D62,Texte!A$45:B$107,2,0),\"\")","v":""},{"$f":"IF(VLOOKUP($D62,'Technische Daten'!$A:$L,10,0) <> \"\",1,0)","v":{"$error":"#N/A"}},{"$f":"IF(F62 = 1,VLOOKUP($D62,'Technische Daten'!$A:$L,3,0) / VLOOKUP($D62,'Technische Daten'!$A:$L,10,0) * (-1),0)","v":{"$error":"#N/A"}},null,null,{"$f":"VLOOKUP($D62,'Technische Daten'!$A:$L,5,0)","v":{"$error":"#N/A"}},{"$f":"IF($D62 <> \"\",VLOOKUP($D62,'Technische Daten'!$A:$L,4,0) - VLOOKUP($D62,'Technische Daten'!$A:$L,10,0) * H62 - I62,0)","v":0},"",{"$f":"IF(D62 <> \"\",IF(N61 <> 0,N61+N62,M60+N61+N62),\"\")","v":""},{"$f":"IF($D62 <> \"\",VLOOKUP($D62,'Technische Daten'!$A:$L,2,0),0)","v":0},{"$f":"IF(D60 <> \"\",1,0)","v":0}]
[null,null,null,null,{"$f":"IF(D63<>\"\",VLOOKUP(D63,Texte!A$45:B$107,2,0),\"\")","v":""},null,null,null,null,null,{"$f":"IF($D63 <> \"\",VLOOKUP($D63,'Technische Daten'!$A:$L,3,0),0)","v":0},{"$f":"K63","v":0},{"$f":"IF(N63 = 0,M62,N63)","v":""},{"$f":"IF($D63 <> \"\",VLOOKUP($D63,'Technische Daten'!$A:$L,2,0),0)","v":0},{"$f":"IF(OR(L64 < 0,M64 < 0,D63 <> \"\",P64 <> 0),1,0)","v":0}]
[null,{"$f":"Texte!$B$98","v":"Modulposition"},{"$f":"(ROW() - 4)/ 2","v":30},null,{"$f":"IF(D64<>\"\",VLOOKUP(D64,Texte!A$45:B$107,2,0),\"\")","v":""},{"$f":"IF(VLOOKUP($D64,'Technische Daten'!$A:$L,10,0) <> \"\",1,0)","v":{"$error":"#N/A"}},{"$f":"IF(F64 = 1,VLOOKUP($D64,'Technische Daten'!$A:$L,3,0) / VLOOKUP($D64,'Technische Daten'!$A:$L,10,0) * (-1),0)","v":{"$error":"#N/A"}},null,null,{"$f":"VLOOKUP($D64,'Technische Daten'!$A:$L,5,0)","v":{"$error":"#N/A"}},{"$f":"IF($D64 <> \"\",VLOOKUP($D64,'Technische Daten'!$A:$L,4,0) - VLOOKUP($D64,'Technische Daten'!$A:$L,10,0) * H64 - I64,0)","v":0},"",{"$f":"IF(D64 <> \"\",IF(N63 <> 0,N63+N64,M62+N63+N64),\"\")","v":""},{"$f":"IF($D64 <> \"\",VLOOKUP($D64,'Technische Daten'!$A:$L,2,0),0)","v":0},{"$f":"IF(D62 <> \"\",1,0)","v":0}]
[null,null,null,null,{"$f":"IF(D65<>\"\",VLOOKUP(D65,Texte!A$45:B$107,2,0),\"\")","v":""},null,null,null,null,null,{"$f":"IF($D65 <> \"\",VLOOKUP($D65,'Technische Daten'!$A:$L,3,0),0)","v":0},{"$f":"K65","v":0},{"$f":"IF(N65 = 0,M64,N65)","v":""},{"$f":"IF($D65 <> \"\",VLOOKUP($D65,'Technische Daten'!$A:$L,2,0),0)","v":0},{"$f":"IF(OR(L66 < 0,M66 < 0,D65 <> \"\",P66 <> 0),1,0)","v":0}]
[null,{"$f":"Texte!$B$98","v":"Modulposition"},{"$f":"(ROW() - 4)/ 2","v":31},null,{"$f":"IF(D66<>\"\",VLOOKUP(D66,Texte!A$45:B$107,2,0),\"\")","v":""},{"$f":"IF(VLOOKUP($D66,'Technische Daten'!$A:$L,10,0) <> \"\",1,0)","v":{"$error":"#N/A"}},{"$f":"IF(F66 = 1,VLOOKUP($D66,'Technische Daten'!$A:$L,3,0) / VLOOKUP($D66,'Technische Daten'!$A:$L,10,0) * (-1),0)","v":{"$error":"#N/A"}},null,null,{"$f":"VLOOKUP($D66,'Technische Daten'!$A:$L,5,0)","v":{"$error":"#N/A"}},{"$f":"IF($D66 <> \"\",VLOOKUP($D66,'Technische Daten'!$A:$L,4,0) - VLOOKUP($D66,'Technische Daten'!$A:$L,10,0) * H66 - I66,0)","v":0},"",{"$f":"IF(D66 <> \"\",IF(N65 <> 0,N65+N66,M64+N65+N66),\"\")","v":""},{"$f":"IF($D66 <> \"\",VLOOKUP($D66,'Technische Daten'!$A:$L,2,0),0)","v":0},{"$f":"IF(D64 <> \"\",1,0)","v":0}]
[null,null,null,null,{"$f":"IF(D67<>\"\",VLOOKUP(D67,Texte!A$45:B$107,2,0),\"\")","v":""},null,null,null,null,null,{"$f":"IF($D67 <> \"\",VLOOKUP($D67,'Technische Daten'!$A:$L,3,0),0)","v":0},{"$f":"K67","v":0},{"$f":"IF(N67 = 0,M66,N67)","v":""},{"$f":"IF($D67 <> \"\",VLOOKUP($D67,'Technische Daten'!$A:$L,2,0),0)","v":0},{"$f":"IF(OR(L68 < 0,M68 < 0,D67 <> \"\",P68 <> 0),1,0)","v":0}]
[null,{"$f":"Texte!$B$98","v":"Modulposition"},{"$f":"(ROW() - 4)/ 2","v":32},null,{"$f":"IF(D68<>\"\",VLOOKUP(D68,Texte!A$45:B$107,2,0),\"\")","v":""},{"$f":"IF(VLOOKUP($D68,'Technische Daten'!$A:$L,10,0) <> \"\",1,0)","v":{"$error":"#N/A"}},{"$f":"IF(F68 = 1,VLOOKUP($D68,'Technische Daten'!$A:$L,3,0) / VLOOKUP($D68,'Technische Daten'!$A:$L,10,0) * (-1),0)","v":{"$error":"#N/A"}},null,null,{"$f":"VLOOKUP($D68,'Technische Daten'!$A:$L,5,0)","v":{"$error":"#N/A"}},{"$f":"IF($D68 <> \"\",VLOOKUP($D68,'Technische Daten'!$A:$L,4,0) - VLOOKUP($D68,'Technische Daten'!$A:$L,10,0) * H68 - I68,0)","v":0},"",{"$f":"IF(D68 <> \"\",IF(N67 <> 0,N67+N68,M66+N67+N68),\"\")","v":""},{"$f":"IF($D68 <> \"\",VLOOKUP($D68,'Technische Daten'!$A:$L,2,0),0)","v":0},{"$f":"IF(D66 <> \"\",1,0)","v":0}]
[null,null,null,null,{"$f":"IF(D69<>\"\",VLOOKUP(D69,Texte!A$45:B$107,2,0),\"\")","v":""},null,null,null,null,null,{"$f":"IF($D69 <> \"\",VLOOKUP($D69,'Technische Daten'!$A:$L,3,0),0)","v":0},{"$f":"K69","v":0},{"$f":"IF(N69 = 0,M68,N69)","v":""},{"$f":"IF($D69 <> \"\",VLOOKUP($D69,'Technische Daten'!$A:$L,2,0),0)","v":0},{"$f":"IF(OR(L70 < 0,M70 < 0,D69 <> \"\",P70 <> 0),1,0)","v":0}]
[null,{"$f":"Texte!$B$98","v":"Modulposition"},{"$f":"(ROW() - 4)/ 2","v":33},null,{"$f":"IF(D70<>\"\",VLOOKUP(D70,Texte!A$45:B$107,2,0),\"\")","v":""},{"$f":"IF(VLOOKUP($D70,'Technische Daten'!$A:$L,10,0) <> \"\",1,0)","v":{"$error":"#N/A"}},{"$f":"IF(F70 = 1,VLOOKUP($D70,'Technische Daten'!$A:$L,3,0) / VLOOKUP($D70,'Technische Daten'!$A:$L,10,0) * (-1),0)","v":{"$error":"#N/A"}},null,null,{"$f":"VLOOKUP($D70,'Technische Daten'!$A:$L,5,0)","v":{"$error":"#N/A"}},{"$f":"IF($D70 <> \"\",VLOOKUP($D70,'Technische Daten'!$A:$L,4,0) - VLOOKUP($D70,'Technische Daten'!$A:$L,10,0) * H70 - I70,0)","v":0},"",{"$f":"IF(D70 <> \"\",IF(N69 <> 0,N69+N70,M68+N69+N70),\"\")","v":""},{"$f":"IF($D70 <> \"\",VLOOKUP($D70,'Technische Daten'!$A:$L,2,0),0)","v":0},{"$f":"IF(D68 <> \"\",1,0)","v":0}]
[null,null,null,null,{"$f":"IF(D71<>\"\",VLOOKUP(D71,Texte!A$45:B$107,2,0),\"\")","v":""},null,null,null,null,null,{"$f":"IF($D71 <> \"\",VLOOKUP($D71,'Technische Daten'!$A:$L,3,0),0)","v":0},{"$f":"K71","v":0},{"$f":"IF(N71 = 0,M70,N71)","v":""},{"$f":"IF($D71 <> \"\",VLOOKUP($D71,'Technische Daten'!$A:$L,2,0),0)","v":0},{"$f":"IF(OR(L72 < 0,M72 < 0,D71 <> \"\",P72 <> 0),1,0)","v":0}]
[null,{"$f":"Texte!$B$98","v":"Modulposition"},{"$f":"(ROW() - 4)/ 2","v":34},null,{"$f":"IF(D72<>\"\",VLOOKUP(D72,Texte!A$45:B$107,2,0),\"\")","v":""},{"$f":"IF(VLOOKUP($D72,'Technische Daten'!$A:$L,10,0) <> \"\",1,0)","v":{"$error":"#N/A"}},{"$f":"IF(F72 = 1,VLOOKUP($D72,'Technische Daten'!$A:$L,3,0) / VLOOKUP($D72,'Technische Daten'!$A:$L,10,0) * (-1),0)","v":{"$error":"#N/A"}},null,null,{"$f":"VLOOKUP($D72,'Technische Daten'!$A:$L,5,0)","v":{"$error":"#N/A"}},{"$f":"IF($D72 <> \"\",VLOOKUP($D72,'Technische Daten'!$A:$L,4,0) - VLOOKUP($D72,'Technische Daten'!$A:$L,10,0) * H72 - I72,0)","v":0},{"$f":"IF(D72<>\"\",IF(D71<>\"\",K71+K72, L70+K71+K72),\"\")","v":""},{"$f":"IF(D72 <> \"\",IF(N71 <> 0,N71+N72,M70+N71+N72),\"\")","v":""},{"$f":"IF($D72 <> \"\",VLOOKUP($D72,'Technische Daten'!$A:$L,2,0),0)","v":0},{"$f":"IF(D70 <> \"\",1,0)","v":0}]
[null,null,null,null,{"$f":"IF(D73<>\"\",VLOOKUP(D73,Texte!A$45:B$107,2,0),\"\")","v":""},null,null,null,null,null,{"$f":"IF($D73 <> \"\",VLOOKUP($D73,'Technische Daten'!$A:$L,3,0),0)","v":0},{"$f":"K73","v":0},{"$f":"IF(N73 = 0,M72,N73)","v":""},{"$f":"IF($D73 <> \"\",VLOOKUP($D73,'Technische Daten'!$A:$L,2,0),0)","v":0},{"$f":"IF(OR(L74 < 0,M74 < 0,D73 <> \"\",P74 <> 0),1,0)","v":0}]
[null,{"$f":"Texte!$B$98","v":"Modulposition"},{"$f":"(ROW() - 4)/ 2","v":35},null,{"$f":"IF(D74<>\"\",VLOOKUP(D74,Texte!A$45:B$107,2,0),\"\")","v":""},{"$f":"IF(VLOOKUP($D74,'Technische Daten'!$A:$L,10,0) <> \"\",1,0)","v":{"$error":"#N/A"}},{"$f":"IF(F74 = 1,VLOOKUP($D74,'Technische Daten'!$A:$L,3,0) / VLOOKUP($D74,'Technische Daten'!$A:$L,10,0) * (-1),0)","v":{"$error":"#N/A"}},null,null,{"$f":"VLOOKUP($D74,'Technische Daten'!$A:$L,5,0)","v":{"$error":"#N/A"}},{"$f":"IF($D74 <> \"\",VLOOKUP($D74,'Technische Daten'!$A:$L,4,0) - VLOOKUP($D74,'Technische Daten'!$A:$L,10,0) * H74 - I74,0)","v":0},"",{"$f":"IF(D74 <> \"\",IF(N73 <> 0,N73+N74,M72+N73+N74),\"\")","v":""},{"$f":"IF($D74 <> \"\",VLOOKUP($D74,'Technische Daten'!$A:$L,2,0),0)","v":0},{"$f":"IF(D72 <> \"\",1,0)","v":0}]
[null,null,null,null,{"$f":"IF(D75<>\"\",VLOOKUP(D75,Texte!A$45:B$107,2,0),\"\")","v":""},null,null,null,null,null,{"$f":"IF($D75 <> \"\",VLOOKUP($D75,'Technische Daten'!$A:$L,3,0),0)","v":0},{"$f":"K75","v":0},{"$f":"IF(N75 = 0,M74,N75)","v":""},{"$f":"IF($D75 <> \"\",VLOOKUP($D75,'Technische Daten'!$A:$L,2,0),0)","v":0},{"$f":"IF(OR(L76 < 0,M76 < 0,D75 <> \"\",P76 <> 0),1,0)","v":0}]
[null,{"$f":"Texte!$B$98","v":"Modulposition"},{"$f":"(ROW() - 4)/ 2","v":36},null,{"$f":"IF(D76<>\"\",VLOOKUP(D76,Texte!A$45:B$107,2,0),\"\")","v":""},{"$f":"IF(VLOOKUP($D76,'Technische Daten'!$A:$L,10,0) <> \"\",1,0)","v":{"$error":"#N/A"}},{"$f":"IF(F76 = 1,VLOOKUP($D76,'Technische Daten'!$A:$L,3,0) / VLOOKUP($D76,'Technische Daten'!$A:$L,10,0) * (-1),0)","v":{"$error":"#N/A"}},null,null,{"$f":"VLOOKUP($D76,'Technische Daten'!$A:$L,5,0)","v":{"$error":"#N/A"}},{"$f":"IF($D76 <> \"\",VLOOKUP($D76,'Technische Daten'!$A:$L,4,0) - VLOOKUP($D76,'Technische Daten'!$A:$L,10,0) * H76 - I76,0)","v":0},"",{"$f":"IF(D76 <> \"\",IF(N75 <> 0,N75+N76,M74+N75+N76),\"\")","v":""},{"$f":"IF($D76 <> \"\",VLOOKUP($D76,'Technische Daten'!$A:$L,2,0),0)","v":0},{"$f":"IF(D74 <> \"\",1,0)","v":0}]
[null,null,null,null,{"$f":"IF(D77<>\"\",VLOOKUP(D77,Texte!A$45:B$107,2,0),\"\")","v":""},null,null,null,null,null,{"$f":"IF($D77 <> \"\",VLOOKUP($D77,'Technische Daten'!$A:$L,3,0),0)","v":0},{"$f":"K77","v":0},{"$f":"IF(N77 = 0,M76,N77)","v":""},{"$f":"IF($D77 <> \"\",VLOOKUP($D77,'Technische Daten'!$A:$L,2,0),0)","v":0},{"$f":"IF(OR(L78 < 0,M78 < 0,D77 <> \"\",P78 <> 0),1,0)","v":0}]
[null,{"$f":"Texte!$B$98","v":"Modulposition"},{"$f":"(ROW() - 4)/ 2","v":37},null,{"$f":"IF(D78<>\"\",VLOOKUP(D78,Texte!A$45:B$107,2,0),\"\")","v":""},{"$f":"IF(VLOOKUP($D78,'Technische Daten'!$A:$L,10,0) <> \"\",1,0)","v":{"$error":"#N/A"}},{"$f":"IF(F78 = 1,VLOOKUP($D78,'Technische Daten'!$A:$L,3,0) / VLOOKUP($D78,'Technische Daten'!$A:$L,10,0) * (-1),0)","v":{"$error":"#N/A"}},null,null,{"$f":"VLOOKUP($D78,'Technische Daten'!$A:$L,5,0)","v":{"$error":"#N/A"}},{"$f":"IF($D78 <> \"\",VLOOKUP($D78,'Technische Daten'!$A:$L,4,0) - VLOOKUP($D78,'Technische Daten'!$A:$L,10,0) * H78 - I78,0)","v":0},"",{"$f":"IF(D78 <> \"\",IF(N77 <> 0,N77+N78,M76+N77+N78),\"\")","v":""},{"$f":"IF($D78 <> \"\",VLOOKUP($D78,'Technische Daten'!$A:$L,2,0),0)","v":0},{"$f":"IF(D76 <> \"\",1,0)","v":0}]
[null,null,null,null,{"$f":"IF(D79<>\"\",VLOOKUP(D79,Texte!A$45:B$107,2,0),\"\")","v":""},null,null,null,null,null,{"$f":"IF($D79 <> \"\",VLOOKUP($D79,'Technische Daten'!$A:$L,3,0),0)","v":0},{"$f":"K79","v":0},{"$f":"IF(N79 = 0,M78,N79)","v":""},{"$f":"IF($D79 <> \"\",VLOOKUP($D79,'Technische Daten'!$A:$L,2,0),0)","v":0},{"$f":"IF(OR(L80 < 0,M80 < 0,D79 <> \"\",P80 <> 0),1,0)","v":0}]
[null,{"$f":"Texte!$B$98","v":"Modulposition"},{"$f":"(ROW() - 4)/ 2","v":38},null,{"$f":"IF(D80<>\"\",VLOOKUP(D80,Texte!A$45:B$107,2,0),\"\")","v":""},{"$f":"IF(VLOOKUP($D80,'Technische Daten'!$A:$L,10,0) <> \"\",1,0)","v":{"$error":"#N/A"}},{"$f":"IF(F80 = 1,VLOOKUP($D80,'Technische Daten'!$A:$L,3,0) / VLOOKUP($D80,'Technische Daten'!$A:$L,10,0) * (-1),0)","v":{"$error":"#N/A"}},null,null,{"$f":"VLOOKUP($D80,'Technische Daten'!$A:$L,5,0)","v":{"$error":"#N/A"}},{"$f":"IF($D80 <> \"\",VLOOKUP($D80,'Technische Daten'!$A:$L,4,0) - VLOOKUP($D80,'Technische Daten'!$A:$L,10,0) * H80 - I80,0)","v":0},"",{"$f":"IF(D80 <> \"\",IF(N79 <> 0,N79+N80,M78+N79+N80),\"\")","v":""},{"$f":"IF($D80 <> \"\",VLOOKUP($D80,'Technische Daten'!$A:$L,2,0),0)","v":0},{"$f":"IF(D78 <> \"\",1,0)","v":0}]
[null,null,null,null,{"$f":"IF(D81<>\"\",VLOOKUP(D81,Texte!A$45:B$107,2,0),\"\")","v":""},null,null,null,null,null,{"$f":"IF($D81 <> \"\",VLOOKUP($D81,'Technische Daten'!$A:$L,3,0),0)","v":0},{"$f":"K81","v":0},{"$f":"IF(N81 = 0,M80,N81)","v":""},{"$f":"IF($D81 <> \"\",VLOOKUP($D81,'Technische Daten'!$A:$L,2,0),0)","v":0},{"$f":"IF(OR(L82 < 0,M82 < 0,D81 <> \"\",P82 <> 0),1,0)","v":0}]
[null,{"$f":"Texte!$B$98","v":"Modulposition"},{"$f":"(ROW() - 4)/ 2","v":39},null,{"$f":"IF(D82<>\"\",VLOOKUP(D82,Texte!A$45:B$107,2,0),\"\")","v":""},{"$f":"IF(VLOOKUP($D82,'Technische Daten'!$A:$L,10,0) <> \"\",1,0)","v":{"$error":"#N/A"}},{"$f":"IF(F82 = 1,VLOOKUP($D82,'Technische Daten'!$A:$L,3,0) / VLOOKUP($D82,'Technische Daten'!$A:$L,10,0) * (-1),0)","v":{"$error":"#N/A"}},null,null,{"$f":"VLOOKUP($D82,'Technische Daten'!$A:$L,5,0)","v":{"$error":"#N/A"}},{"$f":"IF($D82 <> \"\",VLOOKUP($D82,'Technische Daten'!$A:$L,4,0) - VLOOKUP($D82,'Technische Daten'!$A:$L,10,0) * H82 - I82,0)","v":0},"",{"$f":"IF(D82 <> \"\",IF(N81 <> 0,N81+N82,M80+N81+N82),\"\")","v":""},{"$f":"IF($D82 <> \"\",VLOOKUP($D82,'Technische Daten'!$A:$L,2,0),0)","v":0},{"$f":"IF(D80 <> \"\",1,0)","v":0}]
[null,null,null,null,{"$f":"IF(D83<>\"\",VLOOKUP(D83,Texte!A$45:B$107,2,0),\"\")","v":""},null,null,null,null,null,{"$f":"IF($D83 <> \"\",VLOOKUP($D83,'Technische Daten'!$A:$L,3,0),0)","v":0},{"$f":"K83","v":0},{"$f":"IF(N83 = 0,M82,N83)","v":""},{"$f":"IF($D83 <> \"\",VLOOKUP($D83,'Technische Daten'!$A:$L,2,0),0)","v":0},{"$f":"IF(OR(L84 < 0,M84 < 0,D83 <> \"\",P84 <> 0),1,0)","v":0}]
[null,{"$f":"Texte!$B$98","v":"Modulposition"},{"$f":"(ROW() - 4)/ 2","v":40},null,{"$f":"IF(D84<>\"\",VLOOKUP(D84,Texte!A$45:B$107,2,0),\"\")","v":""},{"$f":"IF(VLOOKUP($D84,'Technische Daten'!$A:$L,10,0) <> \"\",1,0)","v":{"$error":"#N/A"}},{"$f":"IF(F84 = 1,VLOOKUP($D84,'Technische Daten'!$A:$L,3,0) / VLOOKUP($D84,'Technische Daten'!$A:$L,10,0) * (-1),0)","v":{"$error":"#N/A"}},null,null,{"$f":"VLOOKUP($D84,'Technische Daten'!$A:$L,5,0)","v":{"$error":"#N/A"}},{"$f":"IF($D84 <> \"\",VLOOKUP($D84,'Technische Daten'!$A:$L,4,0) - VLOOKUP($D84,'Technische Daten'!$A:$L,10,0) * H84 - I84,0)","v":0},"",{"$f":"IF(D84 <> \"\",IF(N83 <> 0,N83+N84,M82+N83+N84),\"\")","v":""},{"$f":"IF($D84 <> \"\",VLOOKUP($D84,'Technische Daten'!$A:$L,2,0),0)","v":0},{"$f":"IF(D82 <> \"\",1,0)","v":0}]
[null,null,null,null,{"$f":"IF(D85<>\"\",VLOOKUP(D85,Texte!A$45:B$107,2,0),\"\")","v":""},null,null,null,null,null,{"$f":"IF($D85 <> \"\",VLOOKUP($D85,'Technische Daten'!$A:$L,3,0),0)","v":0},{"$f":"K85","v":0},{"$f":"IF(N85 = 0,M84,N85)","v":""},{"$f":"IF($D85 <> \"\",VLOOKUP($D85,'Technische Daten'!$A:$L,2,0),0)","v":0},{"$f":"IF(OR(L86 < 0,M86 < 0,D85 <> \"\",P86 <> 0),1,0)","v":0}]
[null,{"$f":"Texte!$B$98","v":"Modulposition"},{"$f":"(ROW() - 4)/ 2","v":41},null,{"$f":"IF(D86<>\"\",VLOOKUP(D86,Texte!A$45:B$107,2,0),\"\")","v":""},{"$f":"IF(VLOOKUP($D86,'Technische Daten'!$A:$L,10,0) <> \"\",1,0)","v":{"$error":"#N/A"}},{"$f":"IF(F86 = 1,VLOOKUP($D86,'Technische Daten'!$A:$L,3,0) / VLOOKUP($D86,'Technische Daten'!$A:$L,10,0) * (-1),0)","v":{"$error":"#N/A"}},null,null,{"$f":"VLOOKUP($D86,'Technische Daten'!$A:$L,5,0)","v":{"$error":"#N/A"}},{"$f":"IF($D86 <> \"\",VLOOKUP($D86,'Technische Daten'!$A:$L,4,0) - VLOOKUP($D86,'Technische Daten'!$A:$L,10,0) * H86 - I86,0)","v":0},"",{"$f":"IF(D86 <> \"\",IF(N85 <> 0,N85+N86,M84+N85+N86),\"\")","v":""},{"$f":"IF($D86 <> \"\",VLOOKUP($D86,'Technische Daten'!$A:$L,2,0),0)","v":0},{"$f":"IF(D84 <> \"\",1,0)","v":0}]
[null,null,null,null,{"$f":"IF(D87<>\"\",VLOOKUP(D87,Texte!A$45:B$107,2,0),\"\")","v":""},null,null,null,null,null,{"$f":"IF($D87 <> \"\",VLOOKUP($D87,'Technische Daten'!$A:$L,3,0),0)","v":0},{"$f":"K87","v":0},{"$f":"IF(N87 = 0,M86,N87)","v":""},{"$f":"IF($D87 <> \"\",VLOOKUP($D87,'Technische Daten'!$A:$L,2,0),0)","v":0},{"$f":"IF(OR(L88 < 0,M88 < 0,D87 <> \"\",P88 <> 0),1,0)","v":0}]
[null,{"$f":"Texte!$B$98","v":"Modulposition"},{"$f":"(ROW() - 4)/ 2","v":42},null,{"$f":"IF(D88<>\"\",VLOOKUP(D88,Texte!A$45:B$107,2,0),\"\")","v":""},{"$f":"IF(VLOOKUP($D88,'Technische Daten'!$A:$L,10,0) <> \"\",1,0)","v":{"$error":"#N/A"}},{"$f":"IF(F88 = 1,VLOOKUP($D88,'Technische Daten'!$A:$L,3,0) / VLOOKUP($D88,'Technische Daten'!$A:$L,10,0) * (-1),0)","v":{"$error":"#N/A"}},null,null,{"$f":"VLOOKUP($D88,'Technische Daten'!$A:$L,5,0)","v":{"$error":"#N/A"}},{"$f":"IF($D88 <> \"\",VLOOKUP($D88,'Technische Daten'!$A:$L,4,0) - VLOOKUP($D88,'Technische Daten'!$A:$L,10,0) * H88 - I88,0)","v":0},"",{"$f":"IF(D88 <> \"\",IF(N87 <> 0,N87+N88,M86+N87+N88),\"\")","v":""},{"$f":"IF($D88 <> \"\",VLOOKUP($D88,'Technische Daten'!$A:$L,2,0),0)","v":0},{"$f":"IF(D86 <> \"\",1,0)","v":0}]
[null,null,null,null,{"$f":"IF(D89<>\"\",VLOOKUP(D89,Texte!A$45:B$107,2,0),\"\")","v":""},null,null,null,null,null,{"$f":"IF($D89 <> \"\",VLOOKUP($D89,'Technische Daten'!$A:$L,3,0),0)","v":0},{"$f":"K89","v":0},{"$f":"IF(N89 = 0,M88,N89)","v":""},{"$f":"IF($D89 <> \"\",VLOOKUP($D89,'Technische Daten'!$A:$L,2,0),0)","v":0},{"$f":"IF(OR(L90 < 0,M90 < 0,D89 <> \"\",P90 <> 0),1,0)","v":0}]
[null,{"$f":"Texte!$B$98","v":"Modulposition"},{"$f":"(ROW() - 4)/ 2","v":43},null,{"$f":"IF(D90<>\"\",VLOOKUP(D90,Texte!A$45:B$107,2,0),\"\")","v":""},{"$f":"IF(VLOOKUP($D90,'Technische Daten'!$A:$L,10,0) <> \"\",1,0)","v":{"$error":"#N/A"}},{"$f":"IF(F90 = 1,VLOOKUP($D90,'Technische Daten'!$A:$L,3,0) / VLOOKUP($D90,'Technische Daten'!$A:$L,10,0) * (-1),0)","v":{"$error":"#N/A"}},null,null,{"$f":"VLOOKUP($D90,'Technische Daten'!$A:$L,5,0)","v":{"$error":"#N/A"}},{"$f":"IF($D90 <> \"\",VLOOKUP($D90,'Technische Daten'!$A:$L,4,0) - VLOOKUP($D90,'Technische Daten'!$A:$L,10,0) * H90 - I90,0)","v":0},"",{"$f":"IF(D90 <> \"\",IF(N89 <> 0,N89+N90,M88+N89+N90),\"\")","v":""},{"$f":"IF($D90 <> \"\",VLOOKUP($D90,'Technische Daten'!$A:$L,2,0),0)","v":0},{"$f":"IF(D88 <> \"\",1,0)","v":0}]
[null,null,null,null,{"$f":"IF(D91<>\"\",VLOOKUP(D91,Texte!A$45:B$107,2,0),\"\")","v":""},null,null,null,null,null,{"$f":"IF($D91 <> \"\",VLOOKUP($D91,'Technische Daten'!$A:$L,3,0),0)","v":0},{"$f":"K91","v":0},{"$f":"IF(N91 = 0,M90,N91)","v":""},{"$f":"IF($D91 <> \"\",VLOOKUP($D91,'Technische Daten'!$A:$L,2,0),0)","v":0},{"$f":"IF(OR(L92 < 0,M92 < 0,D91 <> \"\",P92 <> 0),1,0)","v":0}]
[null,{"$f":"Texte!$B$98","v":"Modulposition"},{"$f":"(ROW() - 4)/ 2","v":44},null,{"$f":"IF(D92<>\"\",VLOOKUP(D92,Texte!A$45:B$107,2,0),\"\")","v":""},{"$f":"IF(VLOOKUP($D92,'Technische Daten'!$A:$L,10,0) <> \"\",1,0)","v":{"$error":"#N/A"}},{"$f":"IF(F92 = 1,VLOOKUP($D92,'Technische Daten'!$A:$L,3,0) / VLOOKUP($D92,'Technische Daten'!$A:$L,10,0) * (-1),0)","v":{"$error":"#N/A"}},null,null,{"$f":"VLOOKUP($D92,'Technische Daten'!$A:$L,5,0)","v":{"$error":"#N/A"}},{"$f":"IF($D92 <> \"\",VLOOKUP($D92,'Technische Daten'!$A:$L,4,0) - VLOOKUP($D92,'Technische Daten'!$A:$L,10,0) * H92 - I92,0)","v":0},"",{"$f":"IF(D92 <> \"\",IF(N91 <> 0,N91+N92,M90+N91+N92),\"\")","v":""},{"$f":"IF($D92 <> \"\",VLOOKUP($D92,'Technische Daten'!$A:$L,2,0),0)","v":0},{"$f":"IF(D90 <> \"\",1,0)","v":0}]
[null,null,null,null,{"$f":"IF(D93<>\"\",VLOOKUP(D93,Texte!A$45:B$107,2,0),\"\")","v":""},null,null,null,null,null,{"$f":"IF($D93 <> \"\",VLOOKUP($D93,'Technische Daten'!$A:$L,3,0),0)","v":0},{"$f":"K93","v":0},{"$f":"IF(N93 = 0,M92,N93)","v":""},{"$f":"IF($D93 <> \"\",VLOOKUP($D93,'Technische Daten'!$A:$L,2,0),0)","v":0},{"$f":"IF(OR(L94 < 0,M94 < 0,D93 <> \"\",P94 <> 0),1,0)","v":0}]
[null,{"$f":"Texte!$B$98","v":"Modulposition"},{"$f":"(ROW() - 4)/ 2","v":45},null,{"$f":"IF(D94<>\"\",VLOOKUP(D94,Texte!A$45:B$107,2,0),\"\")","v":""},{"$f":"IF(VLOOKUP($D94,'Technische Daten'!$A:$L,10,0) <> \"\",1,0)","v":{"$error":"#N/A"}},{"$f":"IF(F94 = 1,VLOOKUP($D94,'Technische Daten'!$A:$L,3,0) / VLOOKUP($D94,'Technische Daten'!$A:$L,10,0) * (-1),0)","v":{"$error":"#N/A"}},null,null,{"$f":"VLOOKUP($D94,'Technische Daten'!$A:$L,5,0)","v":{"$error":"#N/A"}},{"$f":"IF($D94 <> \"\",VLOOKUP($D94,'Technische Daten'!$A:$L,4,0) - VLOOKUP($D94,'Technische Daten'!$A:$L,10,0) * H94 - I94,0)","v":0},"",{"$f":"IF(D94 <> \"\",IF(N93 <> 0,N93+N94,M92+N93+N94),\"\")","v":""},{"$f":"IF($D94 <> \"\",VLOOKUP($D94,'Technische Daten'!$A:$L,2,0),0)","v":0},{"$f":"IF(D92 <> \"\",1,0)","v":0}]
[null,null,null,null,{"$f":"IF(D95<>\"\",VLOOKUP(D95,Texte!A$45:B$107,2,0),\"\")","v":""},null,null,null,null,null,{"$f":"IF($D95 <> \"\",VLOOKUP($D95,'Technische Daten'!$A:$L,3,0),0)","v":0},{"$f":"K95","v":0},{"$f":"IF(N95 = 0,M94,N95)","v":""},{"$f":"IF($D95 <> \"\",VLOOKUP($D95,'Technische Daten'!$A:$L,2,0),0)","v":0},{"$f":"IF(OR(L96 < 0,M96 < 0,D95 <> \"\",P96 <> 0),1,0)","v":0}]
[null,{"$f":"Texte!$B$98","v":"Modulposition"},{"$f":"(ROW() - 4)/ 2","v":46},null,{"$f":"IF(D96<>\"\",VLOOKUP(D96,Texte!A$45:B$107,2,0),\"\")","v":""},{"$f":"IF(VLOOKUP($D96,'Technische Daten'!$A:$L,10,0) <> \"\",1,0)","v":{"$error":"#N/A"}},{"$f":"IF(F96 = 1,VLOOKUP($D96,'Technische Daten'!$A:$L,3,0) / VLOOKUP($D96,'Technische Daten'!$A:$L,10,0) * (-1),0)","v":{"$error":"#N/A"}},null,null,{"$f":"VLOOKUP($D96,'Technische Daten'!$A:$L,5,0)","v":{"$error":"#N/A"}},{"$f":"IF($D96 <> \"\",VLOOKUP($D96,'Technische Daten'!$A:$L,4,0) - VLOOKUP($D96,'Technische Daten'!$A:$L,10,0) * H96 - I96,0)","v":0},"",{"$f":"IF(D96 <> \"\",IF(N95 <> 0,N95+N96,M94+N95+N96),\"\")","v":""},{"$f":"IF($D96 <> \"\",VLOOKUP($D96,'Technische Daten'!$A:$L,2,0),0)","v":0},{"$f":"IF(D94 <> \"\",1,0)","v":0}]
[null,null,null,null,{"$f":"IF(D97<>\"\",VLOOKUP(D97,Texte!A$45:B$107,2,0),\"\")","v":""},null,null,null,null,null,{"$f":"IF($D97 <> \"\",VLOOKUP($D97,'Technische Daten'!$A:$L,3,0),0)","v":0},{"$f":"K97","v":0},{"$f":"IF(N97 = 0,M96,N97)","v":""},{"$f":"IF($D97 <> \"\",VLOOKUP($D97,'Technische Daten'!$A:$L,2,0),0)","v":0},{"$f":"IF(OR(L98 < 0,M98 < 0,D97 <> \"\",P98 <> 0),1,0)","v":0}]
[null,{"$f":"Texte!$B$98","v":"Modulposition"},{"$f":"(ROW() - 4)/ 2","v":47},null,{"$f":"IF(D98<>\"\",VLOOKUP(D98,Texte!A$45:B$107,2,0),\"\")","v":""},{"$f":"IF(VLOOKUP($D98,'Technische Daten'!$A:$L,10,0) <> \"\",1,0)","v":{"$error":"#N/A"}},{"$f":"IF(F98 = 1,VLOOKUP($D98,'Technische Daten'!$A:$L,3,0) / VLOOKUP($D98,'Technische Daten'!$A:$L,10,0) * (-1),0)","v":{"$error":"#N/A"}},null,null,{"$f":"VLOOKUP($D98,'Technische Daten'!$A:$L,5,0)","v":{"$error":"#N/A"}},{"$f":"IF($D98 <> \"\",VLOOKUP($D98,'Technische Daten'!$A:$L,4,0) - VLOOKUP($D98,'Technische Daten'!$A:$L,10,0) * H98 - I98,0)","v":0},"",{"$f":"IF(D98 <> \"\",IF(N97 <> 0,N97+N98,M96+N97+N98),\"\")","v":""},{"$f":"IF($D98 <> \"\",VLOOKUP($D98,'Technische Daten'!$A:$L,2,0),0)","v":0},{"$f":"IF(D96 <> \"\",1,0)","v":0}]
[null,null,null,null,{"$f":"IF(D99<>\"\",VLOOKUP(D99,Texte!A$45:B$107,2,0),\"\")","v":""},null,null,null,null,null,{"$f":"IF($D99 <> \"\",VLOOKUP($D99,'Technische Daten'!$A:$L,3,0),0)","v":0},{"$f":"K99","v":0},{"$f":"IF(N99 = 0,M98,N99)","v":""},{"$f":"IF($D99 <> \"\",VLOOKUP($D99,'Technische Daten'!$A:$L,2,0),0)","v":0},{"$f":"IF(OR(L100 < 0,M100 < 0,D99 <> \"\",P100 <> 0),1,0)","v":0}]
[null,{"$f":"Texte!$B$98","v":"Modulposition"},{"$f":"(ROW() - 4)/ 2","v":48},null,{"$f":"IF(D100<>\"\",VLOOKUP(D100,Texte!A$45:B$107,2,0),\"\")","v":""},{"$f":"IF(VLOOKUP($D100,'Technische Daten'!$A:$L,10,0) <> \"\",1,0)","v":{"$error":"#N/A"}},{"$f":"IF(F100 = 1,VLOOKUP($D100,'Technische Daten'!$A:$L,3,0) / VLOOKUP($D100,'Technische Daten'!$A:$L,10,0) * (-1),0)","v":{"$error":"#N/A"}},null,null,{"$f":"VLOOKUP($D100,'Technische Daten'!$A:$L,5,0)","v":{"$error":"#N/A"}},{"$f":"IF($D100 <> \"\",VLOOKUP($D100,'Technische Daten'!$A:$L,4,0) - VLOOKUP($D100,'Technische Daten'!$A:$L,10,0) * H100 - I100,0)","v":0},"",{"$f":"IF(D100 <> \"\",IF(N99 <> 0,N99+N100,M98+N99+N100),\"\")","v":""},{"$f":"IF($D100 <> \"\",VLOOKUP($D100,'Technische Daten'!$A:$L,2,0),0)","v":0},{"$f":"IF(D98 <> \"\",1,0)","v":0}]
[null,null,null,null,{"$f":"IF(D101<>\"\",VLOOKUP(D101,Texte!A$45:B$107,2,0),\"\")","v":""},null,null,null,null,null,{"$f":"IF($D101 <> \"\",VLOOKUP($D101,'Technische Daten'!$A:$L,3,0),0)","v":0},{"$f":"K101","v":0},{"$f":"IF(N101 = 0,M100,N101)","v":""},{"$f":"IF($D101 <> \"\",VLOOKUP($D101,'Technische Daten'!$A:$L,2,0),0)","v":0},{"$f":"IF(OR(L102 < 0,M102 < 0,D101 <> \"\",P102 <> 0),1,0)","v":0}]
[null,{"$f":"Texte!$B$98","v":"Modulposition"},{"$f":"(ROW() - 4)/ 2","v":49},null,{"$f":"IF(D102<>\"\",VLOOKUP(D102,Texte!A$45:B$107,2,0),\"\")","v":""},{"$f":"IF(VLOOKUP($D102,'Technische Daten'!$A:$L,10,0) <> \"\",1,0)","v":{"$error":"#N/A"}},{"$f":"IF(F102 = 1,VLOOKUP($D102,'Technische Daten'!$A:$L,3,0) / VLOOKUP($D102,'Technische Daten'!$A:$L,10,0) * (-1),0)","v":{"$error":"#N/A"}},null,null,{"$f":"VLOOKUP($D102,'Technische Daten'!$A:$L,5,0)","v":{"$error":"#N/A"}},{"$f":"IF($D102 <> \"\",VLOOKUP($D102,'Technische Daten'!$A:$L,4,0) - VLOOKUP($D102,'Technische Daten'!$A:$L,10,0) * H102 - I102,0)","v":0},"",{"$f":"IF(D102 <> \"\",IF(N101 <> 0,N101+N102,M100+N101+N102),\"\")","v":""},{"$f":"IF($D102 <> \"\",VLOOKUP($D102,'Technische Daten'!$A:$L,2,0),0)","v":0},{"$f":"IF(D100 <> \"\",1,0)","v":0}]
[null,null,null,null,{"$f":"IF(D103<>\"\",VLOOKUP(D103,Texte!A$45:B$107,2,0),\"\")","v":""},null,null,null,null,null,{"$f":"IF($D103 <> \"\",VLOOKUP($D103,'Technische Daten'!$A:$L,3,0),0)","v":0},{"$f":"K103","v":0},{"$f":"IF(N103 = 0,M102,N103)","v":""},{"$f":"IF($D103 <> \"\",VLOOKUP($D103,'Technische Daten'!$A:$L,2,0),0)","v":0},{"$f":"IF(OR(L104 < 0,M104 < 0,D103 <> \"\",P104 <> 0),1,0)","v":0}]
[null,{"$f":"Texte!$B$98","v":"Modulposition"},{"$f":"(ROW() - 4)/ 2","v":50},null,{"$f":"IF(D104<>\"\",VLOOKUP(D104,Texte!A$45:B$107,2,0),\"\")","v":""},{"$f":"IF(VLOOKUP($D104,'Technische Daten'!$A:$L,10,0) <> \"\",1,0)","v":{"$error":"#N/A"}},{"$f":"IF(F104 = 1,VLOOKUP($D104,'Technische Daten'!$A:$L,3,0) / VLOOKUP($D104,'Technische Daten'!$A:$L,10,0) * (-1),0)","v":{"$error":"#N/A"}},null,null,{"$f":"VLOOKUP($D104,'Technische Daten'!$A:$L,5,0)","v":{"$error":"#N/A"}},{"$f":"IF($D104 <> \"\",VLOOKUP($D104,'Technische Daten'!$A:$L,4,0) - VLOOKUP($D104,'Technische Daten'!$A:$L,10,0) * H104 - I104,0)","v":0},"",{"$f":"IF(D104 <> \"\",IF(N103 <> 0,N103+N104,M102+N103+N104),\"\")","v":""},{"$f":"IF($D104 <> \"\",VLOOKUP($D104,'Technische Daten'!$A:$L,2,0),0)","v":0},{"$f":"IF(D102 <> \"\",1,0)","v":0}]
[null,null,null,null,{"$f":"IF(D105<>\"\",VLOOKUP(D105,Texte!A$45:B$107,2,0),\"\")","v":""},null,null,null,null,null,{"$f":"IF($D105 <> \"\",VLOOKUP($D105,'Technische Daten'!$A:$L,3,0),0)","v":0},{"$f":"K105","v":0},{"$f":"IF(N105 = 0,M104,N105)","v":""},{"$f":"IF($D105 <> \"\",VLOOKUP($D105,'Technische Daten'!$A:$L,2,0),0)","v":0},{"$f":"IF(OR(L106 < 0,M106 < 0,D105 <> \"\",P106 <> 0),1,0)","v":0}]
[null,{"$f":"Texte!$B$98","v":"Modulposition"},{"$f":"(ROW() - 4)/ 2","v":51},null,{"$f":"IF(D106<>\"\",VLOOKUP(D106,Texte!A$45:B$107,2,0),\"\")","v":""},{"$f":"IF(VLOOKUP($D106,'Technische Daten'!$A:$L,10,0) <> \"\",1,0)","v":{"$error":"#N/A"}},{"$f":"IF(F106 = 1,VLOOKUP($D106,'Technische Daten'!$A:$L,3,0) / VLOOKUP($D106,'Technische Daten'!$A:$L,10,0) * (-1),0)","v":{"$error":"#N/A"}},null,null,{"$f":"VLOOKUP($D106,'Technische Daten'!$A:$L,5,0)","v":{"$error":"#N/A"}},{"$f":"IF($D106 <> \"\",VLOOKUP($D106,'Technische Daten'!$A:$L,4,0) - VLOOKUP($D106,'Technische Daten'!$A:$L,10,0) * H106 - I106,0)","v":0},"",{"$f":"IF(D106 <> \"\",IF(N105 <> 0,N105+N106,M104+N105+N106),\"\")","v":""},{"$f":"IF($D106 <> \"\",VLOOKUP($D106,'Technische Daten'!$A:$L,2,0),0)","v":0},{"$f":"IF(D104 <> \"\",1,0)","v":0}]
[null,null,null,null,{"$f":"IF(D107<>\"\",VLOOKUP(D107,Texte!A$45:B$107,2,0),\"\")","v":""},null,null,null,null,null,{"$f":"IF($D107 <> \"\",VLOOKUP($D107,'Technische Daten'!$A:$L,3,0),0)","v":0},{"$f":"K107","v":0},{"$f":"IF(N107 = 0,M106,N107)","v":""},{"$f":"IF($D107 <> \"\",VLOOKUP($D107,'Technische Daten'!$A:$L,2,0),0)","v":0},{"$f":"IF(OR(L108 < 0,M108 < 0,D107 <> \"\",P108 <> 0),1,0)","v":0}]
[null,{"$f":"Texte!$B$98","v":"Modulposition"},{"$f":"(ROW() - 4)/ 2","v":52},null,{"$f":"IF(D108<>\"\",VLOOKUP(D108,Texte!A$45:B$107,2,0),\"\")","v":""},{"$f":"IF(VLOOKUP($D108,'Technische Daten'!$A:$L,10,0) <> \"\",1,0)","v":{"$error":"#N/A"}},{"$f":"IF(F108 = 1,VLOOKUP($D108,'Technische Daten'!$A:$L,3,0) / VLOOKUP($D108,'Technische Daten'!$A:$L,10,0) * (-1),0)","v":{"$error":"#N/A"}},null,null,{"$f":"VLOOKUP($D108,'Technische Daten'!$A:$L,5,0)","v":{"$error":"#N/A"}},{"$f":"IF($D108 <> \"\",VLOOKUP($D108,'Technische Daten'!$A:$L,4,0) - VLOOKUP($D108,'Technische Daten'!$A:$L,10,0) * H108 - I108,0)","v":0},"",{"$f":"IF(D108 <> \"\",IF(N107 <> 0,N107+N108,M106+N107+N108),\"\")","v":""},{"$f":"IF($D108 <> \"\",VLOOKUP($D108,'Technische Daten'!$A:$L,2,0),0)","v":0},{"$f":"IF(D106 <> \"\",1,0)","v":0}]
[null,null,null,null,{"$f":"IF(D109<>\"\",VLOOKUP(D109,Texte!A$45:B$107,2,0),\"\")","v":""},null,null,null,null,null,{"$f":"IF($D109 <> \"\",VLOOKUP($D109,'Technische Daten'!$A:$L,3,0),0)","v":0},{"$f":"K109","v":0},{"$f":"IF(N109 = 0,M108,N109)","v":""},{"$f":"IF($D109 <> \"\",VLOOKUP($D109,'Technische Daten'!$A:$L,2,0),0)","v":0},{"$f":"IF(OR(L110 < 0,M110 < 0,D109 <> \"\",P110 <> 0),1,0)","v":0}]
[null,{"$f":"Texte!$B$98","v":"Modulposition"},{"$f":"(ROW() - 4)/ 2","v":53},null,{"$f":"IF(D110<>\"\",VLOOKUP(D110,Texte!A$45:B$107,2,0),\"\")","v":""},{"$f":"IF(VLOOKUP($D110,'Technische Daten'!$A:$L,10,0) <> \"\",1,0)","v":{"$error":"#N/A"}},{"$f":"IF(F110 = 1,VLOOKUP($D110,'Technische Daten'!$A:$L,3,0) / VLOOKUP($D110,'Technische Daten'!$A:$L,10,0) * (-1),0)","v":{"$error":"#N/A"}},null,null,{"$f":"VLOOKUP($D110,'Technische Daten'!$A:$L,5,0)","v":{"$error":"#N/A"}},{"$f":"IF($D110 <> \"\",VLOOKUP($D110,'Technische Daten'!$A:$L,4,0) - VLOOKUP($D110,'Technische Daten'!$A:$L,10,0) * H110 - I110,0)","v":0},"",{"$f":"IF(D110 <> \"\",IF(N109 <> 0,N109+N110,M108+N109+N110),\"\")","v":""},{"$f":"IF($D110 <> \"\",VLOOKUP($D110,'Technische Daten'!$A:$L,2,0),0)","v":0},{"$f":"IF(D108 <> \"\",1,0)","v":0}]
[null,null,null,null,{"$f":"IF(D111<>\"\",VLOOKUP(D111,Texte!A$45:B$107,2,0),\"\")","v":""},null,null,null,null,null,{"$f":"IF($D111 <> \"\",VLOOKUP($D111,'Technische Daten'!$A:$L,3,0),0)","v":0},{"$f":"K111","v":0},{"$f":"IF(N111 = 0,M110,N111)","v":""},{"$f":"IF($D111 <> \"\",VLOOKUP($D111,'Technische Daten'!$A:$L,2,0),0)","v":0},{"$f":"IF(OR(L112 < 0,M112 < 0,D111 <> \"\",P112 <> 0),1,0)","v":0}]
[null,{"$f":"Texte!$B$98","v":"Modulposition"},{"$f":"(ROW() - 4)/ 2","v":54},null,{"$f":"IF(D112<>\"\",VLOOKUP(D112,Texte!A$45:B$107,2,0),\"\")","v":""},{"$f":"IF(VLOOKUP($D112,'Technische Daten'!$A:$L,10,0) <> \"\",1,0)","v":{"$error":"#N/A"}},{"$f":"IF(F112 = 1,VLOOKUP($D112,'Technische Daten'!$A:$L,3,0) / VLOOKUP($D112,'Technische Daten'!$A:$L,10,0) * (-1),0)","v":{"$error":"#N/A"}},null,null,{"$f":"VLOOKUP($D112,'Technische Daten'!$A:$L,5,0)","v":{"$error":"#N/A"}},{"$f":"IF($D112 <> \"\",VLOOKUP($D112,'Technische Daten'!$A:$L,4,0) - VLOOKUP($D112,'Technische Daten'!$A:$L,10,0) * H112 - I112,0)","v":0},"",{"$f":"IF(D112 <> \"\",IF(N111 <> 0,N111+N112,M110+N111+N112),\"\")","v":""},{"$f":"IF($D112 <> \"\",VLOOKUP($D112,'Technische Daten'!$A:$L,2,0),0)","v":0},{"$f":"IF(D110 <> \"\",1,0)","v":0}]
[null,null,null,null,{"$f":"IF(D113<>\"\",VLOOKUP(D113,Texte!A$45:B$107,2,0),\"\")","v":""},null,null,null,null,null,{"$f":"IF($D113 <> \"\",VLOOKUP($D113,'Technische Daten'!$A:$L,3,0),0)","v":0},{"$f":"K113","v":0},{"$f":"IF(N113 = 0,M112,N113)","v":""},{"$f":"IF($D113 <> \"\",VLOOKUP($D113,'Technische Daten'!$A:$L,2,0),0)","v":0},{"$f":"IF(OR(L114 < 0,M114 < 0,D113 <> \"\",P114 <> 0),1,0)","v":0}]
[null,{"$f":"Texte!$B$98","v":"Modulposition"},{"$f":"(ROW() - 4)/ 2","v":55},null,{"$f":"IF(D114<>\"\",VLOOKUP(D114,Texte!A$45:B$107,2,0),\"\")","v":""},{"$f":"IF(VLOOKUP($D114,'Technische Daten'!$A:$L,10,0) <> \"\",1,0)","v":{"$error":"#N/A"}},{"$f":"IF(F114 = 1,VLOOKUP($D114,'Technische Daten'!$A:$L,3,0) / VLOOKUP($D114,'Technische Daten'!$A:$L,10,0) * (-1),0)","v":{"$error":"#N/A"}},null,null,{"$f":"VLOOKUP($D114,'Technische Daten'!$A:$L,5,0)","v":{"$error":"#N/A"}},{"$f":"IF($D114 <> \"\",VLOOKUP($D114,'Technische Daten'!$A:$L,4,0) - VLOOKUP($D114,'Technische Daten'!$A:$L,10,0) * H114 - I114,0)","v":0},"",{"$f":"IF(D114 <> \"\",IF(N113 <> 0,N113+N114,M112+N113+N114),\"\")","v":""},{"$f":"IF($D114 <> \"\",VLOOKUP($D114,'Technische Daten'!$A:$L,2,0),0)","v":0},{"$f":"IF(D112 <> \"\",1,0)","v":0}]
[null,null,null,null,{"$f":"IF(D115<>\"\",VLOOKUP(D115,Texte!A$45:B$107,2,0),\"\")","v":""},null,null,null,null,null,{"$f":"IF($D115 <> \"\",VLOOKUP($D115,'Technische Daten'!$A:$L,3,0),0)","v":0},{"$f":"K115","v":0},{"$f":"IF(N115 = 0,M114,N115)","v":""},{"$f":"IF($D115 <> \"\",VLOOKUP($D115,'Technische Daten'!$A:$L,2,0),0)","v":0},{"$f":"IF(OR(L116 < 0,M116 < 0,D115 <> \"\",P116 <> 0),1,0)","v":0}]
[null,{"$f":"Texte!$B$98","v":"Modulposition"},{"$f":"(ROW() - 4)/ 2","v":56},null,{"$f":"IF(D116<>\"\",VLOOKUP(D116,Texte!A$45:B$107,2,0),\"\")","v":""},{"$f":"IF(VLOOKUP($D116,'Technische Daten'!$A:$L,10,0) <> \"\",1,0)","v":{"$error":"#N/A"}},{"$f":"IF(F116 = 1,VLOOKUP($D116,'Technische Daten'!$A:$L,3,0) / VLOOKUP($D116,'Technische Daten'!$A:$L,10,0) * (-1),0)","v":{"$error":"#N/A"}},null,null,{"$f":"VLOOKUP($D116,'Technische Daten'!$A:$L,5,0)","v":{"$error":"#N/A"}},{"$f":"IF($D116 <> \"\",VLOOKUP($D116,'Technische Daten'!$A:$L,4,0) - VLOOKUP($D116,'Technische Daten'!$A:$L,10,0) * H116 - I116,0)","v":0},"",{"$f":"IF(D116 <> \"\",IF(N115 <> 0,N115+N116,M114+N115+N116),\"\")","v":""},{"$f":"IF($D116 <> \"\",VLOOKUP($D116,'Technische Daten'!$A:$L,2,0),0)","v":0},{"$f":"IF(D114 <> \"\",1,0)","v":0}]
[null,null,null,null,{"$f":"IF(D117<>\"\",VLOOKUP(D117,Texte!A$45:B$107,2,0),\"\")","v":""},null,null,null,null,null,{"$f":"IF($D117 <> \"\",VLOOKUP($D117,'Technische Daten'!$A:$L,3,0),0)","v":0},{"$f":"K117","v":0},{"$f":"IF(N117 = 0,M116,N117)","v":""},{"$f":"IF($D117 <> \"\",VLOOKUP($D117,'Technische Daten'!$A:$L,2,0),0)","v":0},{"$f":"IF(OR(L118 < 0,M118 < 0,D117 <> \"\",P118 <> 0),1,0)","v":0}]
[null,{"$f":"Texte!$B$98","v":"Modulposition"},{"$f":"(ROW() - 4)/ 2","v":57},null,{"$f":"IF(D118<>\"\",VLOOKUP(D118,Texte!A$45:B$107,2,0),\"\")","v":""},{"$f":"IF(VLOOKUP($D118,'Technische Daten'!$A:$L,10,0) <> \"\",1,0)","v":{"$error":"#N/A"}},{"$f":"IF(F118 = 1,VLOOKUP($D118,'Technische Daten'!$A:$L,3,0) / VLOOKUP($D118,'Technische Daten'!$A:$L,10,0) * (-1),0)","v":{"$error":"#N/A"}},null,null,{"$f":"VLOOKUP($D118,'Technische Daten'!$A:$L,5,0)","v":{"$error":"#N/A"}},{"$f":"IF($D118 <> \"\",VLOOKUP($D118,'Technische Daten'!$A:$L,4,0) - VLOOKUP($D118,'Technische Daten'!$A:$L,10,0) * H118 - I118,0)","v":0},"",{"$f":"IF(D118 <> \"\",IF(N117 <> 0,N117+N118,M116+N117+N118),\"\")","v":""},{"$f":"IF($D118 <> \"\",VLOOKUP($D118,'Technische Daten'!$A:$L,2,0),0)","v":0},{"$f":"IF(D116 <> \"\",1,0)","v":0}]
[null,null,null,null,{"$f":"IF(D119<>\"\",VLOOKUP(D119,Texte!A$45:B$107,2,0),\"\")","v":""},null,null,null,null,null,{"$f":"IF($D119 <> \"\",VLOOKUP($D119,'Technische Daten'!$A:$L,3,0),0)","v":0},{"$f":"K119","v":0},{"$f":"IF(N119 = 0,M118,N119)","v":""},{"$f":"IF($D119 <> \"\",VLOOKUP($D119,'Technische Daten'!$A:$L,2,0),0)","v":0},{"$f":"IF(OR(L120 < 0,M120 < 0,D119 <> \"\",P120 <> 0),1,0)","v":0}]
[null,{"$f":"Texte!$B$98","v":"Modulposition"},{"$f":"(ROW() - 4)/ 2","v":58},null,{"$f":"IF(D120<>\"\",VLOOKUP(D120,Texte!A$45:B$107,2,0),\"\")","v":""},{"$f":"IF(VLOOKUP($D120,'Technische Daten'!$A:$L,10,0) <> \"\",1,0)","v":{"$error":"#N/A"}},{"$f":"IF(F120 = 1,VLOOKUP($D120,'Technische Daten'!$A:$L,3,0) / VLOOKUP($D120,'Technische Daten'!$A:$L,10,0) * (-1),0)","v":{"$error":"#N/A"}},null,null,{"$f":"VLOOKUP($D120,'Technische Daten'!$A:$L,5,0)","v":{"$error":"#N/A"}},{"$f":"IF($D120 <> \"\",VLOOKUP($D120,'Technische Daten'!$A:$L,4,0) - VLOOKUP($D120,'Technische Daten'!$A:$L,10,0) * H120 - I120,0)","v":0},"",{"$f":"IF(D120 <> \"\",IF(N119 <> 0,N119+N120,M118+N119+N120),\"\")","v":""},{"$f":"IF($D120 <> \"\",VLOOKUP($D120,'Technische Daten'!$A:$L,2,0),0)","v":0},{"$f":"IF(D118 <> \"\",1,0)","v":0}]
[null,null,null,null,{"$f":"IF(D121<>\"\",VLOOKUP(D121,Texte!A$45:B$107,2,0),\"\")","v":""},null,null,null,null,null,{"$f":"IF($D121 <> \"\",VLOOKUP($D121,'Technische Daten'!$A:$L,3,0),0)","v":0},{"$f":"K121","v":0},{"$f":"IF(N121 = 0,M120,N121)","v":""},{"$f":"IF($D121 <> \"\",VLOOKUP($D121,'Technische Daten'!$A:$L,2,0),0)","v":0},{"$f":"IF(OR(L122 < 0,M122 < 0,D121 <> \"\",P122 <> 0),1,0)","v":0}]
[null,{"$f":"Texte!$B$98","v":"Modulposition"},{"$f":"(ROW() - 4)/ 2","v":59},null,{"$f":"IF(D122<>\"\",VLOOKUP(D122,Texte!A$45:B$107,2,0),\"\")","v":""},{"$f":"IF(VLOOKUP($D122,'Technische Daten'!$A:$L,10,0) <> \"\",1,0)","v":{"$error":"#N/A"}},{"$f":"IF(F122 = 1,VLOOKUP($D122,'Technische Daten'!$A:$L,3,0) / VLOOKUP($D122,'Technische Daten'!$A:$L,10,0) * (-1),0)","v":{"$error":"#N/A"}},null,null,{"$f":"VLOOKUP($D122,'Technische Daten'!$A:$L,5,0)","v":{"$error":"#N/A"}},{"$f":"IF($D122 <> \"\",VLOOKUP($D122,'Technische Daten'!$A:$L,4,0) - VLOOKUP($D122,'Technische Daten'!$A:$L,10,0) * H122 - I122,0)","v":0},"",{"$f":"IF(D122 <> \"\",IF(N121 <> 0,N121+N122,M120+N121+N122),\"\")","v":""},{"$f":"IF($D122 <> \"\",VLOOKUP($D122,'Technische Daten'!$A:$L,2,0),0)","v":0},{"$f":"IF(D120 <> \"\",1,0)","v":0}]
[null,null,null,null,{"$f":"IF(D123<>\"\",VLOOKUP(D123,Texte!A$45:B$107,2,0),\"\")","v":""},null,null,null,null,null,{"$f":"IF($D123 <> \"\",VLOOKUP($D123,'Technische Daten'!$A:$L,3,0),0)","v":0},{"$f":"K123","v":0},{"$f":"IF(N123 = 0,M122,N123)","v":""},{"$f":"IF($D123 <> \"\",VLOOKUP($D123,'Technische Daten'!$A:$L,2,0),0)","v":0},{"$f":"IF(OR(L124 < 0,M124 < 0,D123 <> \"\",P124 <> 0),1,0)","v":0}]
[null,{"$f":"Texte!$B$98","v":"Modulposition"},{"$f":"(ROW() - 4)/ 2","v":60},null,{"$f":"IF(D124<>\"\",VLOOKUP(D124,Texte!A$45:B$107,2,0),\"\")","v":""},{"$f":"IF(VLOOKUP($D124,'Technische Daten'!$A:$L,10,0) <> \"\",1,0)","v":{"$error":"#N/A"}},{"$f":"IF(F124 = 1,VLOOKUP($D124,'Technische Daten'!$A:$L,3,0) / VLOOKUP($D124,'Technische Daten'!$A:$L,10,0) * (-1),0)","v":{"$error":"#N/A"}},null,null,{"$f":"VLOOKUP($D124,'Technische Daten'!$A:$L,5,0)","v":{"$error":"#N/A"}},{"$f":"IF($D124 <> \"\",VLOOKUP($D124,'Technische Daten'!$A:$L,4,0) - VLOOKUP($D124,'Technische Daten'!$A:$L,10,0) * H124 - I124,0)","v":0},"",{"$f":"IF(D124 <> \"\",IF(N123 <> 0,N123+N124,M122+N123+N124),\"\")","v":""},{"$f":"IF($D124 <> \"\",VLOOKUP($D124,'Technische Daten'!$A:$L,2,0),0)","v":0},{"$f":"IF(D122 <> \"\",1,0)","v":0}]
[null,null,null,null,{"$f":"IF(D125<>\"\",VLOOKUP(D125,Texte!A$45:B$107,2,0),\"\")","v":""},null,null,null,null,null,{"$f":"IF($D125 <> \"\",VLOOKUP($D125,'Technische Daten'!$A:$L,3,0),0)","v":0},{"$f":"K125","v":0},{"$f":"IF(N125 = 0,M124,N125)","v":""},{"$f":"IF($D125 <> \"\",VLOOKUP($D125,'Technische Daten'!$A:$L,2,0),0)","v":0},{"$f":"IF(OR(L126 < 0,M126 < 0,D125 <> \"\",P126 <> 0),1,0)","v":0}]
[null,{"$f":"Texte!$B$98","v":"Modulposition"},{"$f":"(ROW() - 4)/ 2","v":61},null,{"$f":"IF(D126<>\"\",VLOOKUP(D126,Texte!A$45:B$107,2,0),\"\")","v":""},{"$f":"IF(VLOOKUP($D126,'Technische Daten'!$A:$L,10,0) <> \"\",1,0)","v":{"$error":"#N/A"}},{"$f":"IF(F126 = 1,VLOOKUP($D126,'Technische Daten'!$A:$L,3,0) / VLOOKUP($D126,'Technische Daten'!$A:$L,10,0) * (-1),0)","v":{"$error":"#N/A"}},null,null,{"$f":"VLOOKUP($D126,'Technische Daten'!$A:$L,5,0)","v":{"$error":"#N/A"}},{"$f":"IF($D126 <> \"\",VLOOKUP($D126,'Technische Daten'!$A:$L,4,0) - VLOOKUP($D126,'Technische Daten'!$A:$L,10,0) * H126 - I126,0)","v":0},"",{"$f":"IF(D126 <> \"\",IF(N125 <> 0,N125+N126,M124+N125+N126),\"\")","v":""},{"$f":"IF($D126 <> \"\",VLOOKUP($D126,'Technische Daten'!$A:$L,2,0),0)","v":0},{"$f":"IF(D124 <> \"\",1,0)","v":0}]
[null,null,null,null,{"$f":"IF(D127<>\"\",VLOOKUP(D127,Texte!A$45:B$107,2,0),\"\")","v":""},null,null,null,null,null,{"$f":"IF($D127 <> \"\",VLOOKUP($D127,'Technische Daten'!$A:$L,3,0),0)","v":0},{"$f":"K127","v":0},{"$f":"IF(N127 = 0,M126,N127)","v":""},{"$f":"IF($D127 <> \"\",VLOOKUP($D127,'Technische Daten'!$A:$L,2,0),0)","v":0},{"$f":"IF(OR(L128 < 0,M128 < 0,D127 <> \"\",P128 <> 0),1,0)","v":0}]
[null,{"$f":"Texte!$B$98","v":"Modulposition"},{"$f":"(ROW() - 4)/ 2","v":62},null,{"$f":"IF(D128<>\"\",VLOOKUP(D128,Texte!A$45:B$107,2,0),\"\")","v":""},{"$f":"IF(VLOOKUP($D128,'Technische Daten'!$A:$L,10,0) <> \"\",1,0)","v":{"$error":"#N/A"}},{"$f":"IF(F128 = 1,VLOOKUP($D128,'Technische Daten'!$A:$L,3,0) / VLOOKUP($D128,'Technische Daten'!$A:$L,10,0) * (-1),0)","v":{"$error":"#N/A"}},null,null,{"$f":"VLOOKUP($D128,'Technische Daten'!$A:$L,5,0)","v":{"$error":"#N/A"}},{"$f":"IF($D128 <> \"\",VLOOKUP($D128,'Technische Daten'!$A:$L,4,0) - VLOOKUP($D128,'Technische Daten'!$A:$L,10,0) * H128 - I128,0)","v":0},"",{"$f":"IF(D128 <> \"\",IF(N127 <> 0,N127+N128,M126+N127+N128),\"\")","v":""},{"$f":"IF($D128 <> \"\",VLOOKUP($D128,'Technische Daten'!$A:$L,2,0),0)","v":0},{"$f":"IF(D126 <> \"\",1,0)","v":0}]
[null,null,null,null,{"$f":"IF(D129<>\"\",VLOOKUP(D129,Texte!A$45:B$107,2,0),\"\")","v":""},null,null,null,null,null,{"$f":"IF($D129 <> \"\",VLOOKUP($D129,'Technische Daten'!$A:$L,3,0),0)","v":0},{"$f":"K129","v":0},{"$f":"IF(N129 = 0,M128,N129)","v":""},{"$f":"IF($D129 <> \"\",VLOOKUP($D129,'Technische Daten'!$A:$L,2,0),0)","v":0},{"$f":"IF(OR(L130 < 0,M130 < 0,D129 <> \"\",P130 <> 0),1,0)","v":0}]
[null,{"$f":"Texte!$B$98","v":"Modulposition"},{"$f":"(ROW() - 4)/ 2","v":63},null,{"$f":"IF(D130<>\"\",VLOOKUP(D130,Texte!A$45:B$107,2,0),\"\")","v":""},{"$f":"IF(VLOOKUP($D130,'Technische Daten'!$A:$L,10,0) <> \"\",1,0)","v":{"$error":"#N/A"}},{"$f":"IF(F130 = 1,VLOOKUP($D130,'Technische Daten'!$A:$L,3,0) / VLOOKUP($D130,'Technische Daten'!$A:$L,10,0) * (-1),0)","v":{"$error":"#N/A"}},null,null,{"$f":"VLOOKUP($D130,'Technische Daten'!$A:$L,5,0)","v":{"$error":"#N/A"}},{"$f":"IF($D130 <> \"\",VLOOKUP($D130,'Technische Daten'!$A:$L,4,0) - VLOOKUP($D130,'Technische Daten'!$A:$L,10,0) * H130 - I130,0)","v":0},"",{"$f":"IF(D130 <> \"\",IF(N129 <> 0,N129+N130,M128+N129+N130),\"\")","v":""},{"$f":"IF($D130 <> \"\",VLOOKUP($D130,'Technische Daten'!$A:$L,2,0),0)","v":0},{"$f":"IF(D128 <> \"\",1,0)","v":0}]
[null,null,null,null,{"$f":"IF(D131<>\"\",VLOOKUP(D131,Texte!A$45:B$107,2,0),\"\")","v":""},null,null,null,null,null,{"$f":"IF($D131 <> \"\",VLOOKUP($D131,'Technische Daten'!$A:$L,3,0),0)","v":0},{"$f":"K131","v":0},{"$f":"IF(N131 = 0,M130,N131)","v":""},{"$f":"IF($D131 <> \"\",VLOOKUP($D131,'Technische Daten'!$A:$L,2,0),0)","v":0},{"$f":"IF(OR(L132 < 0,M132 < 0,D131 <> \"\",P132 <> 0),1,0)","v":0}]
[null,{"$f":"Texte!$B$98","v":"Modulposition"},{"$f":"(ROW() - 4)/ 2","v":64},null,{"$f":"IF(D132<>\"\",VLOOKUP(D132,Texte!A$45:B$107,2,0),\"\")","v":""},{"$f":"IF(VLOOKUP($D132,'Technische Daten'!$A:$L,10,0) <> \"\",1,0)","v":{"$error":"#N/A"}},{"$f":"IF(F132 = 1,VLOOKUP($D132,'Technische Daten'!$A:$L,3,0) / VLOOKUP($D132,'Technische Daten'!$A:$L,10,0) * (-1),0)","v":{"$error":"#N/A"}},null,null,{"$f":"VLOOKUP($D132,'Technische Daten'!$A:$L,5,0)","v":{"$error":"#N/A"}},{"$f":"IF($D132 <> \"\",VLOOKUP($D132,'Technische Daten'!$A:$L,4,0) - VLOOKUP($D132,'Technische Daten'!$A:$L,10,0) * H132 - I132,0)","v":0},"",{"$f":"IF(D132 <> \"\",IF(N131 <> 0,N131+N132,M130+N131+N132),\"\")","v":""},{"$f":"IF($D132 <> \"\",VLOOKUP($D132,'Technische Daten'!$A:$L,2,0),0)","v":0},{"$f":"IF(D130 <> \"\",1,0)","v":0}]