{"text_format":"1","workbook":"xlsx","n_sheets":4,"sheets":["Konfiguration","Technische Daten","Texte","physikalischer Aufbau"],"not_rendered":{"charts":0,"images":4,"macros":1,"external_links":0,"defined_names":34,"comments":3,"pivot_tables":0},"unopened":[],"bounds":{"document_bytes":16777216,"sheet_cells":100000,"rows_first":2000,"rows_last":500,"rows_between":2000,"halvings":0,"cell_chars":16384,"cell_head_chars":4096},"cells_cut":0,"cells_raw":0,"read":"whole","date_system":"1900"}

{"sheet":"Konfiguration","index":0,"n_rows":104,"n_cols":50,"rows_kept":104,"cut":false,"hidden":false,"merged":[[0,1,1,1]]}
["V1.13",{"$f":"Texte!B44","v":"durchschnittliche Ausgangsbelastung(%)"},{"$f":"Texte!B45","v":"CANopen"},{"$f":"Texte!$B46","v":"PROFIBUS"},{"$f":"Texte!$B47","v":"EtherCAT"},{"$f":"Texte!$B48","v":"PROFINET"},{"$f":"Texte!$B49","v":"DeviceNet"},{"$f":"Texte!$B50","v":"Modbus TCP"},{"$f":"Texte!$B51","v":"L-force Controller"},{"$f":"Texte!$B52","v":"2 DI"},{"$f":"Texte!$B53","v":"4 DI"},{"$f":"Texte!$B54","v":"8 DI"},{"$f":"Texte!$B55","v":"4 DI 3-Leiter"},{"$f":"Texte!$B56","v":"2 DI NPN"},{"$f":"Texte!$B57","v":"4 DI NPN"},{"$f":"Texte!$B58","v":"8 DI NPN"},{"$f":"Texte!$B59","v":"2 DI 2µs"},{"$f":"Texte!$B60","v":"2 DO"},{"$f":"Texte!$B61","v":"4 DO"},{"$f":"Texte!$B62","v":"8 DO"},{"$f":"Texte!$B63","v":"2 DO NPN"},{"$f":"Texte!$B64","v":"4 DO NPN"},{"$f":"Texte!$B65","v":"8 DO NPN"},{"$f":"Texte!$B66","v":"2 DO 2A"},{"$f":"Texte!B67","v":"2 DO Relais"},{"$f":"Texte!$B68","v":"4 DO 2A"},{"$f":"Texte!$B69","v":"2 DO 1µs"},{"$f":"Texte!$B70","v":"2 AI 0..10V"},{"$f":"Texte!$B71","v":"4 AI 0..10V"},{"$f":"Texte!$B72","v":"2 AI 0(4)-20mA"},{"$f":"Texte!$B73","v":"4 AI 0(4)-20mA"},{"$f":"Texte!$B74","v":"4 AI Resistor"},{"$f":"Texte!$B75","v":"2 AI Thermo"},{"$f":"Texte!$B76","v":"2 AI -10..10 V 16 Bit"},{"$f":"Texte!$B77","v":"2 AI 0(4)..20 mA 16 Bit"},{"$f":"Texte!$B78","v":"2 AO 0..10V"},{"$f":"Texte!$B79","v":"4 AO 0..10V"},{"$f":"Texte!$B80","v":"2 AO 4..20mA"},{"$f":"Texte!$B81","v":"4 AO 4..20mA"},{"$f":"Texte!$B82","v":"1-fach Zähler 24 V / 1 DO"},{"$f":"Texte!$B83","v":"2-fach Zähler 24 V"},{"$f":"Texte!$B84","v":"1-fach Zähler 5 V"},{"$f":"Texte!$B83","v":"2-fach Zähler 24 V"},{"$f":"Texte!$B86","v":"SSI"},{"$f":"Texte!$B87","v":"PWM"},{"$f":"Texte!$B88","v":"RS 232"},{"$f":"Texte!$B89","v":"RS 422/485"},{"$f":"Texte!$B91","v":"I/O-Versorgung (Sicherung)"},{"$f":"Texte!$B92","v":"I/O / Elektronik"},{"$f":"Texte!$B92","v":"I/O / Elektronik"}]
["DE",null,"EPM-S110","EPM-S120","EPM-S130","EPM-S140","EPM-S150","EPM-S160","3200 C","EPM-S200","EPM-S201","EPM-S202","EPM-S203","EPM-S204","EPM-S205","EPM-S206","EPM-S207","EPM-S300","EPM-S301","EPM-S302","EPM-S303","EPM-S304","EPM-S305","EPM-S306","EPM-S308","EPM-S309","EPM-S310","EPM-S400","EPM-S401","EPM-S402","EPM-S403","EPM-S404","EPM-S405","EPM-S406","EPM-S408","EPM-S500","EPM-S501","EPM-S502","EPM-S503","EPM-S600","EPM-S601","EPM-S602","EPM-S603","EPM-S604","EPM-S620","EPM-S640","EPM-S650","EPM-S701","EPM-S702","EPM-S703"]
[{"$f":"Texte!B116","v":"Eingabe Bedarf"},0.625]
[{"$f":"Texte!B104","v":"Summe physikalischer Aufbau"},null,{"$f":"SUMIF('physikalischer Aufbau'!$D$4:$D$132,Konfiguration!C2,'physikalischer Aufbau'!$O$4:$O$132)","v":0},{"$f":"SUMIF('physikalischer Aufbau'!$D$4:$D$132,Konfiguration!D2,'physikalischer Aufbau'!$O$4:$O$132)","v":0},{"$f":"SUMIF('physikalischer Aufbau'!$D$4:$D$132,Konfiguration!E2,'physikalischer Aufbau'!$O$4:$O$132)","v":0},{"$f":"SUMIF('physikalischer Aufbau'!$D$4:$D$132,Konfiguration!F2,'physikalischer Aufbau'!$O$4:$O$132)","v":0},{"$f":"SUMIF('physikalischer Aufbau'!$D$4:$D$132,Konfiguration!G2,'physikalischer Aufbau'!$O$4:$O$132)","v":0},{"$f":"SUMIF('physikalischer Aufbau'!$D$4:$D$132,Konfiguration!H2,'physikalischer Aufbau'!$O$4:$O$132)","v":0},{"$f":"SUMIF('physikalischer Aufbau'!$D$4:$D$132,Konfiguration!I2,'physikalischer Aufbau'!$O$4:$O$132)","v":0},{"$f":"SUMIF('physikalischer Aufbau'!$D$4:$D$132,Konfiguration!J2,'physikalischer Aufbau'!$O$4:$O$132)","v":0},{"$f":"SUMIF('physikalischer Aufbau'!$D$4:$D$132,Konfiguration!K2,'physikalischer Aufbau'!$O$4:$O$132)","v":0},{"$f":"SUMIF('physikalischer Aufbau'!$D$4:$D$132,Konfiguration!L2,'physikalischer Aufbau'!$O$4:$O$132)","v":0},{"$f":"SUMIF('physikalischer Aufbau'!$D$4:$D$132,Konfiguration!M2,'physikalischer Aufbau'!$O$4:$O$132)","v":0},{"$f":"SUMIF('physikalischer Aufbau'!$D$4:$D$132,Konfiguration!N2,'physikalischer Aufbau'!$O$4:$O$132)","v":0},{"$f":"SUMIF('physikalischer Aufbau'!$D$4:$D$132,Konfiguration!O2,'physikalischer Aufbau'!$O$4:$O$132)","v":0},{"$f":"SUMIF('physikalischer Aufbau'!$D$4:$D$132,Konfiguration!P2,'physikalischer Aufbau'!$O$4:$O$132)","v":0},{"$f":"SUMIF('physikalischer Aufbau'!$D$4:$D$132,Konfiguration!Q2,'physikalischer Aufbau'!$O$4:$O$132)","v":0},{"$f":"SUMIF('physikalischer Aufbau'!$D$4:$D$132,Konfiguration!R2,'physikalischer Aufbau'!$O$4:$O$132)","v":0},{"$f":"SUMIF('physikalischer Aufbau'!$D$4:$D$132,Konfiguration!S2,'physikalischer Aufbau'!$O$4:$O$132)","v":0},{"$f":"SUMIF('physikalischer Aufbau'!$D$4:$D$132,Konfiguration!T2,'physikalischer Aufbau'!$O$4:$O$132)","v":0},{"$f":"SUMIF('physikalischer Aufbau'!$D$4:$D$132,Konfiguration!U2,'physikalischer Aufbau'!$O$4:$O$132)","v":0},{"$f":"SUMIF('physikalischer Aufbau'!$D$4:$D$132,Konfiguration!V2,'physikalischer Aufbau'!$O$4:$O$132)","v":0},{"$f":"SUMIF('physikalischer Aufbau'!$D$4:$D$132,Konfiguration!W2,'physikalischer Aufbau'!$O$4:$O$132)","v":0},{"$f":"SUMIF('physikalischer Aufbau'!$D$4:$D$132,Konfiguration!X2,'physikalischer Aufbau'!$O$4:$O$132)","v":0},{"$f":"SUMIF('physikalischer Aufbau'!$D$4:$D$132,Konfiguration!Y2,'physikalischer Aufbau'!$O$4:$O$132)","v":0},{"$f":"SUMIF('physikalischer Aufbau'!$D$4:$D$132,Konfiguration!Z2,'physikalischer Aufbau'!$O$4:$O$132)","v":0},{"$f":"SUMIF('physikalischer Aufbau'!$D$4:$D$132,Konfiguration!AA2,'physikalischer Aufbau'!$O$4:$O$132)","v":0},{"$f":"SUMIF('physikalischer Aufbau'!$D$4:$D$132,Konfiguration!AB2,'physikalischer Aufbau'!$O$4:$O$132)","v":0},{"$f":"SUMIF('physikalischer Aufbau'!$D$4:$D$132,Konfiguration!AC2,'physikalischer Aufbau'!$O$4:$O$132)","v":0},{"$f":"SUMIF('physikalischer Aufbau'!$D$4:$D$132,Konfiguration!AD2,'physikalischer Aufbau'!$O$4:$O$132)","v":0},{"$f":"SUMIF('physikalischer Aufbau'!$D$4:$D$132,Konfiguration!AE2,'physikalischer Aufbau'!$O$4:$O$132)","v":0},{"$f":"SUMIF('physikalischer Aufbau'!$D$4:$D$132,Konfiguration!AF2,'physikalischer Aufbau'!$O$4:$O$132)","v":0},{"$f":"SUMIF('physikalischer Aufbau'!$D$4:$D$132,Konfiguration!AG2,'physikalischer Aufbau'!$O$4:$O$132)","v":0},null,null,{"$f":"SUMIF('physikalischer Aufbau'!$D$4:$D$132,Konfiguration!AJ2,'physikalischer Aufbau'!$O$4:$O$132)","v":0},{"$f":"SUMIF('physikalischer Aufbau'!$D$4:$D$132,Konfiguration!AK2,'physikalischer Aufbau'!$O$4:$O$132)","v":0},{"$f":"SUMIF('physikalischer Aufbau'!$D$4:$D$132,Konfiguration!AL2,'physikalischer Aufbau'!$O$4:$O$132)","v":0},{"$f":"SUMIF('physikalischer Aufbau'!$D$4:$D$132,Konfiguration!AM2,'physikalischer Aufbau'!$O$4:$O$132)","v":0},{"$f":"SUMIF('physikalischer Aufbau'!$D$4:$D$132,Konfiguration!AN2,'physikalischer Aufbau'!$O$4:$O$132)","v":0},{"$f":"SUMIF('physikalischer Aufbau'!$D$4:$D$132,Konfiguration!AO2,'physikalischer Aufbau'!$O$4:$O$132)","v":0},{"$f":"SUMIF('physikalischer Aufbau'!$D$4:$D$132,Konfiguration!AP2,'physikalischer Aufbau'!$O$4:$O$132)","v":0},{"$f":"SUMIF('physikalischer Aufbau'!$D$4:$D$132,Konfiguration!AQ2,'physikalischer Aufbau'!$O$4:$O$132)","v":0},{"$f":"SUMIF('physikalischer Aufbau'!$D$4:$D$132,Konfiguration!AR2,'physikalischer Aufbau'!$O$4:$O$132)","v":0},{"$f":"SUMIF('physikalischer Aufbau'!$D$4:$D$132,Konfiguration!AS2,'physikalischer Aufbau'!$O$4:$O$132)","v":0},{"$f":"SUMIF('physikalischer Aufbau'!$D$4:$D$132,Konfiguration!AT2,'physikalischer Aufbau'!$O$4:$O$132)","v":0},{"$f":"SUMIF('physikalischer Aufbau'!$D$4:$D$132,Konfiguration!AU2,'physikalischer Aufbau'!$O$4:$O$132)","v":0},{"$f":"SUMIF('physikalischer Aufbau'!$D$4:$D$132,Konfiguration!AV2,'physikalischer Aufbau'!$O$4:$O$132)","v":0},null,{"$f":"SUMIF('physikalischer Aufbau'!$D$4:$D$132,Konfiguration!AX2,'physikalischer Aufbau'!$O$4:$O$132)","v":0}]
[{"$f":"Texte!$B$106","v":"Stromschienenbelastung (UL)"},"10A",{"$f":"IF(EPM_S110 + EPM_S120 + EPM_S130 + EPM_S140 + EPM_S150 + EPM_S160 + _3200_C< 2,1,0)","v":1},0,null,null,null,null,null,{"$f":"IF(B61<=64,1,\"\")","v":1}]
[]
[{"$f":"Texte!B2","v":"Elektronikversorgung"}]
[{"$f":"Texte!B3","v":"Gesamtstrombelastung Elektronik (A)"},{"$f":"SUM(J8:AT8) / 1000 * (-1)","v":0},{"$f":"IF(C$3<>\"\",C$3*VLOOKUP(C$2,'Technische Daten'!$A:$G,2,0),0)","v":0},{"$f":"IF(D$3<>\"\",D$3*VLOOKUP(D$2,'Technische Daten'!$A:$G,2,0),0)","v":0},{"$f":"IF(E$3<>\"\",E$3*VLOOKUP(E$2,'Technische Daten'!$A:$G,2,0),0)","v":0},{"$f":"IF(F$3<>\"\",F$3*VLOOKUP(F$2,'Technische Daten'!$A:$G,2,0),0)","v":0},{"$f":"IF(G$3<>\"\",G$3*VLOOKUP(G$2,'Technische Daten'!$A:$G,2,0),0)","v":0},{"$f":"IF(H$3<>\"\",H$3*VLOOKUP(H$2,'Technische Daten'!$A:$G,2,0),0)","v":0},{"$f":"IF(I$3<>\"\",I$3*VLOOKUP(I$2,'Technische Daten'!$A:$G,2,0),0)","v":0},{"$f":"IF(J$3<>\"\",J$3*VLOOKUP(J$2,'Technische Daten'!$A:$G,2,0),0)","v":0},{"$f":"IF(K$3<>\"\",K$3*VLOOKUP(K$2,'Technische Daten'!$A:$G,2,0),0)","v":0},{"$f":"IF(L$3<>\"\",L$3*VLOOKUP(L$2,'Technische Daten'!$A:$G,2,0),0)","v":0},{"$f":"IF(M$3<>\"\",M$3*VLOOKUP(M$2,'Technische Daten'!$A:$G,2,0),0)","v":0},{"$f":"IF(N$3<>\"\",N$3*VLOOKUP(N$2,'Technische Daten'!$A:$G,2,0),0)","v":0},{"$f":"IF(O$3<>\"\",O$3*VLOOKUP(O$2,'Technische Daten'!$A:$G,2,0),0)","v":0},{"$f":"IF(P$3<>\"\",P$3*VLOOKUP(P$2,'Technische Daten'!$A:$G,2,0),0)","v":0},{"$f":"IF(Q$3<>\"\",Q$3*VLOOKUP(Q$2,'Technische Daten'!$A:$G,2,0),0)","v":0},{"$f":"IF(R$3<>\"\",R$3*VLOOKUP(R$2,'Technische Daten'!$A:$G,2,0),0)","v":0},{"$f":"IF(S$3<>\"\",S$3*VLOOKUP(S$2,'Technische Daten'!$A:$G,2,0),0)","v":0},{"$f":"IF(T$3<>\"\",T$3*VLOOKUP(T$2,'Technische Daten'!$A:$G,2,0),0)","v":0},{"$f":"IF(U$3<>\"\",U$3*VLOOKUP(U$2,'Technische Daten'!$A:$G,2,0),0)","v":0},{"$f":"IF(V$3<>\"\",V$3*VLOOKUP(V$2,'Technische Daten'!$A:$G,2,0),0)","v":0},{"$f":"IF(W$3<>\"\",W$3*VLOOKUP(W$2,'Technische Daten'!$A:$G,2,0),0)","v":0},{"$f":"IF(X$3<>\"\",X$3*VLOOKUP(X$2,'Technische Daten'!$A:$G,2,0),0)","v":0},{"$f":"IF(Y$3<>\"\",Y$3*VLOOKUP(Y$2,'Technische Daten'!$A:$G,2,0),0)","v":0},{"$f":"IF(Z$3<>\"\",Z$3*VLOOKUP(Z$2,'Technische Daten'!$A:$G,2,0),0)","v":0},{"$f":"IF(AA$3<>\"\",AA$3*VLOOKUP(AA$2,'Technische Daten'!$A:$G,2,0),0)","v":0},{"$f":"IF(AB$3<>\"\",AB$3*VLOOKUP(AB$2,'Technische Daten'!$A:$G,2,0),0)","v":0},{"$f":"IF(AC$3<>\"\",AC$3*VLOOKUP(AC$2,'Technische Daten'!$A:$G,2,0),0)","v":0},{"$f":"IF(AD$3<>\"\",AD$3*VLOOKUP(AD$2,'Technische Daten'!$A:$G,2,0),0)","v":0},{"$f":"IF(AE$3<>\"\",AE$3*VLOOKUP(AE$2,'Technische Daten'!$A:$G,2,0),0)","v":0},{"$f":"IF(AF$3<>\"\",AF$3*VLOOKUP(AF$2,'Technische Daten'!$A:$G,2,0),0)","v":0},{"$f":"IF(AG$3<>\"\",AG$3*VLOOKUP(AG$2,'Technische Daten'!$A:$G,2,0),0)","v":0},{"$f":"IF(AH$3<>\"\",AH$3*VLOOKUP(AH$2,'Technische Daten'!$A:$G,2,0),0)","v":0},{"$f":"IF(AI$3<>\"\",AI$3*VLOOKUP(AI$2,'Technische Daten'!$A:$G,2,0),0)","v":0},{"$f":"IF(AJ$3<>\"\",AJ$3*VLOOKUP(AJ$2,'Technische Daten'!$A:$G,2,0),0)","v":0},{"$f":"IF(AK$3<>\"\",AK$3*VLOOKUP(AK$2,'Technische Daten'!$A:$G,2,0),0)","v":0},{"$f":"IF(AL$3<>\"\",AL$3*VLOOKUP(AL$2,'Technische Daten'!$A:$G,2,0),0)","v":0},{"$f":"IF(AM$3<>\"\",AM$3*VLOOKUP(AM$2,'Technische Daten'!$A:$G,2,0),0)","v":0},{"$f":"IF(AN$3<>\"\",AN$3*VLOOKUP(AN$2,'Technische Daten'!$A:$G,2,0),0)","v":0},{"$f":"IF(AO$3<>\"\",AO$3*VLOOKUP(AO$2,'Technische Daten'!$A:$G,2,0),0)","v":0},{"$f":"IF(AP$3<>\"\",AP$3*VLOOKUP(AP$2,'Technische Daten'!$A:$G,2,0),0)","v":0},{"$f":"IF(AQ$3<>\"\",AQ$3*VLOOKUP(AQ$2,'Technische Daten'!$A:$G,2,0),0)","v":0},{"$f":"IF(AR$3<>\"\",AR$3*VLOOKUP(AR$2,'Technische Daten'!$A:$G,2,0),0)","v":0},{"$f":"IF(AS$3<>\"\",AS$3*VLOOKUP(AS$2,'Technische Daten'!$A:$G,2,0),0)","v":0},{"$f":"IF(AT$3<>\"\",AT$3*VLOOKUP(AT$2,'Technische Daten'!$A:$G,2,0),0)","v":0},{"$f":"IF(AU$3<>\"\",AU$3*VLOOKUP(AU$2,'Technische Daten'!$A:$G,2,0),0)","v":0},{"$f":"IF(AV$3<>\"\",AV$3*VLOOKUP(AV$2,'Technische Daten'!$A:$G,2,0),0)","v":0},{"$f":"IF(AW$3<>\"\",AW$3*VLOOKUP(AW$2,'Technische Daten'!$A:$G,2,0),0)","v":0},{"$f":"IF(AX$3<>\"\",AX$3*VLOOKUP(AX$2,'Technische Daten'!$A:$G,2,0),0)","v":0}]
[{"$f":"Texte!B4","v":"Einspeisestrom Elektronik (A)"},{"$f":"(SUM(C8:I8)+SUM(AU8:AX8))/1000","v":0}]
[{"$f":"Texte!B5","v":"benötigte Powermodule EPM-S702"},{"$f":"IF(SUM(C8:AT8)<0,ROUNDUP(SUM(C8:AT8)*(-1)/VLOOKUP($AW$2,'Technische Daten'!$A:$G,2,0),0),0)","v":0}]
{"$rows_left_out":95}
{"sheet":"Technische Daten","index":1,"n_rows":71,"n_cols":28,"rows_kept":71,"cut":false,"hidden":true,"merged":[]}
["Typ","Elektronikstrom",{"$f":"IF(Konfiguration!B5 = Texte!B107,'Technische Daten'!N1,'Technische Daten'!M1)","v":"I/O Strom max"},"I/O Strom zusätzlich fest","zusätzlicher I/O-Strom (Annahme)","max. Eingangs-PDO Tx (Bit)","max. Ausgangs-PDO Rx (Bit)","Parameter","Anzahl DI","Anzahl DO","Anzahl AI","Anzahl AO","I/O Strom max","I/O Strom UL","Eingangs-PDO Tx (Bit) CAN Drive-based (7 PDOs frei, 2 feste kommen ggf hinzu)","Ausgangs-PDO Rx CAN Drive-based(Bit) (7 PDOs frei, 2 feste kommen ggf hinzu)","min. Eingangs-PDO Tx (Bit)","min. Ausgangs-PDO Rx (Bit)","EPM-S110","EPM-S120","EPM-S130","EPM-S140","EPM-S150","EPM-S160","3200 C","Breite (mm)","Drive based festes PDO","min Zykluszeit (µs)"]
["EPM-S110",3000,{"$f":"HLOOKUP($C$1,$M:$N,ROW()-ROW($B$1)+1,FALSE)","v":10000},null,null,{"$f":"16*8*8","v":1024},{"$f":"16*8*8","v":1024},null,null,null,null,null,10000,7000,512,512,{"$f":"16*8*8","v":1024},{"$f":"16*8*8","v":1024},null,null,null,null,null,null,null,48]
["EPM-S120",3000,10000,null,null,{"$f":"244*8","v":1952},{"$f":"244*8","v":1952},{"$f":"224*8","v":1792},null,null,null,null,10000,7000,null,null,{"$f":"244*8","v":1952},{"$f":"244*8","v":1952},null,null,null,null,null,null,null,48]
["EPM-S130",3000,10000,null,null,{"$f":"1024*4*8","v":32768},{"$f":"1024*4*8","v":32768},null,null,null,null,null,10000,7000,null,null,{"$f":"F4","v":32768},32768,null,null,null,null,null,null,null,48]
["EPM-S140",3000,10000,null,null,{"$f":"512*8","v":4096},{"$f":"512*8","v":4096},{"$f":"4068*8","v":32544},null,null,null,null,10000,7000,null,null,4096,4096,null,null,null,null,null,null,null,48]
["EPM-S150",3000,10000,null,null,{"$f":"256*8","v":2048},{"$f":"256*8","v":2048},null,null,null,null,null,10000,7000,null,null,2048,2048,null,null,null,null,null,null,null,48]
["EPM-S160",3000,10000,null,null,{"$f":"1024*8","v":8192},{"$f":"1024*8","v":8192},null,null,null,null,null,10000,7000,null,null,8192,8192,null,null,null,null,null,null,null,48]
["3200 C",1700,0,null,null,{"$f":"(2048-256)*8","v":14336},null,null,null,null,null,null,0,0,null,null,{"$f":"2048-128","v":1920},null,null,null,null,null,null,null,null,136,null,1000]
["EPM-S200",-55,{"$f":"HLOOKUP($C$1,$M:$N,ROW()-ROW($B$1)+1,FALSE)","v":0},null,null,{"$f":"HLOOKUP($C$71,$S:$Y,ROW()-ROW($B$1)+1,FALSE)","v":-2},null,0,2,null,null,null,null,null,{"$f":"S9","v":-2},{"$f":"G9","v":0},{"$f":"F9","v":-2},null,-2,-8,-8,-8,-8,-8,-2,12.5,1]
["EPM-S201",-55,0,null,null,-4,null,0,4,null,null,null,null,null,{"$f":"S10","v":-4},0,{"$f":"F10","v":-4},null,-4,-8,-8,-8,-8,-8,-4,12.5,1]
{"$rows_left_out":62}
{"sheet":"Texte","index":2,"n_rows":116,"n_cols":6,"rows_kept":116,"cut":false,"hidden":true,"merged":[]}
["Sprache",{"$f":"Konfiguration!A2","v":"DE"},null,"DE","EN"]
[null,{"$f":"HLOOKUP($B$1,$D:$K,ROW()-ROW($B$1)+1,FALSE)","v":"Elektronikversorgung"},null,"Elektronikversorgung","Electronics Supply"]
[null,"Gesamtstrombelastung Elektronik (A)",null,"Gesamtstrombelastung Elektronik (A)","total current electronics (A)"]
[null,"Einspeisestrom Elektronik (A)",null,"Einspeisestrom Elektronik (A)","available supply current electronics (A)"]
[null,"benötigte Powermodule EPM-S702",null,"benötigte Powermodule EPM-S702","number supply modules EPM-S701/702"]
[null,"Konfigurationscheck",null,"Konfigurationscheck","Configuration Check"]
[null,"I/O-Versorgung",null,"I/O-Versorgung","I/O supply"]
[null,"Gesamtstrom I/O (A)",null,"Gesamtstrom I/O (A)","total current I/O (A)"]
[null,"Einspeisestrom I/O (A)",null,"Einspeisestrom I/O (A)","available supply current I/O (A)"]
[null,"benötigte Powermodule EPM-S701",null,"benötigte Powermodule EPM-S701","number supply modules EPM-S701",1]
{"$rows_left_out":107}
{"sheet":"physikalischer Aufbau","index":3,"n_rows":132,"n_cols":17,"rows_kept":132,"cut":false,"hidden":false,"merged":[[1,1,1,2]]}
[]
[null,null,null,{"$f":"Texte!B99","v":"Modul"},{"$f":"Texte!B100","v":"Funktion"},"ist DO","max Strom je Kanal",{"$f":"Texte!B101","v":"Ausgangsstrom je Kanal (mA)"},{"$f":"Texte!B110","v":"Laststrom je Kanal (mA) (Geber, AO)"},"Laststrom default","Ausgangsstrom",{"$f":"Texte!B102","v":"verfügbarer Ausgangsstrom (A)"},{"$f":"Texte!B103","v":"verfügbarer Elektronikstrom (A)"},"Elektronikstrom","Zeile anzeigen",{"$f":"Texte!B115","v":"zusätzliche Versorgung einfügen"}]
[]
["EPM-S110",{"$f":"Texte!B97","v":"Buskoppler"},null,null,{"$f":"IF(D4<>\"\",VLOOKUP(D4,Texte!A$45:B$107,2,0),\"\")","v":""},null,null,null,null,null,{"$f":"VLOOKUP($D4,'Technische Daten'!$A:$L,3,0)","v":{"$error":"#N/A"}},{"$f":"IF(D4 <> \"\",K4,0)","v":0},{"$f":"N4","v":0},{"$f":"IF($D4 <> \"\",VLOOKUP($D4,'Technische Daten'!$A:$L,2,0),0)","v":0},1]
["EPM-S120",null,null,null,null,null,null,null,null,null,{"$f":"IF($D5 <> \"\",VLOOKUP($D5,'Technische Daten'!$A:$L,3,0),0)","v":0},{"$f":"IF(D5 <> \"\",K5,0)","v":0},null,{"$f":"IF($D5 <> \"\",VLOOKUP($D5,'Technische Daten'!$A:$L,2,0),0)","v":0},{"$f":"IF(OR(L6 < 0,M6 < 0,D5 <> \"\",P6<> \"\"),1,0)","v":0}]
["EPM-S130",{"$f":"Texte!$B$98","v":"Modulposition"},{"$f":"(ROW() - 4)/ 2","v":1},null,{"$f":"IF(D6<>\"\",VLOOKUP(D6,Texte!A$45:B$107,2,0),\"\")","v":""},{"$f":"IF(VLOOKUP($D6,'Technische Daten'!$A:$L,10,0) <> \"\",1,0)","v":{"$error":"#N/A"}},{"$f":"IF(F6 = 1,VLOOKUP($D6,'Technische Daten'!$A:$L,3,0) / VLOOKUP($D6,'Technische Daten'!$A:$L,10,0) * (-1),0)","v":{"$error":"#N/A"}},null,null,{"$f":"VLOOKUP($D6,'Technische Daten'!$A:$L,5,0)","v":{"$error":"#N/A"}},{"$f":"IF($D6 <> \"\",VLOOKUP($D6,'Technische Daten'!$A:$L,4,0) - VLOOKUP($D6,'Technische Daten'!$A:$L,10,0) * H6 - I6,0)","v":0},{"$f":"IF(D6<>\"\",K4+K5+K6,\"\")","v":""},{"$f":"IF(D6 <> \"\",IF(N4 <> 0,N4+N6,M3+N4+N6),\"\")","v":""},{"$f":"IF($D6 <> \"\",VLOOKUP($D6,'Technische Daten'!$A:$L,2,0),0)","v":0},1,null,{"$f":"Texte!B114","v":"x"}]
["EPM-S140",null,null,null,{"$f":"IF(D7<>\"\",VLOOKUP(D7,Texte!A$45:B$107,2,0),\"\")","v":""},null,null,null,null,null,{"$f":"IF($D7 <> \"\",VLOOKUP($D7,'Technische Daten'!$A:$L,3,0),0)","v":0},{"$f":"K7","v":0},{"$f":"IF(N7 = 0,M6,N7)","v":""},{"$f":"IF($D7 <> \"\",VLOOKUP($D7,'Technische Daten'!$A:$L,2,0),0)","v":0},{"$f":"IF(OR(L8 < 0,M8 < 0,D7 <> \"\",P8 <> 0),1,0)","v":0}]
["EPM-S150",{"$f":"Texte!$B$98","v":"Modulposition"},{"$f":"(ROW() - 4)/ 2","v":2},null,{"$f":"IF(D8<>\"\",VLOOKUP(D8,Texte!A$45:B$107,2,0),\"\")","v":""},{"$f":"IF(VLOOKUP($D8,'Technische Daten'!$A:$L,10,0) <> \"\",1,0)","v":{"$error":"#N/A"}},{"$f":"IF(F8 = 1,VLOOKUP($D8,'Technische Daten'!$A:$L,3,0) / VLOOKUP($D8,'Technische Daten'!$A:$L,10,0) * (-1),0)","v":{"$error":"#N/A"}},null,null,{"$f":"VLOOKUP($D8,'Technische Daten'!$A:$L,5,0)","v":{"$error":"#N/A"}},{"$f":"IF($D8 <> \"\",VLOOKUP($D8,'Technische Daten'!$A:$L,4,0) - VLOOKUP($D8,'Technische Daten'!$A:$L,10,0) * H8 - I8,0)","v":0},{"$f":"IF(D8<>\"\",IF(D7<>\"\",K7+K8, L6+K7+K8),\"\")","v":""},{"$f":"IF(D8 <> \"\",IF(N7 <> 0,N7+N8,M6+N7+N8),\"\")","v":""},{"$f":"IF($D8 <> \"\",VLOOKUP($D8,'Technische Daten'!$A:$L,2,0),0)","v":0},{"$f":"IF(D6 <> \"\",1,0)","v":0}]
["EPM-S160",null,null,null,{"$f":"IF(D9<>\"\",VLOOKUP(D9,Texte!A$45:B$107,2,0),\"\")","v":""},null,null,null,null,null,{"$f":"IF($D9 <> \"\",VLOOKUP($D9,'Technische Daten'!$A:$L,3,0),0)","v":0},{"$f":"K9","v":0},{"$f":"IF(N9 = 0,M8,N9)","v":""},{"$f":"IF($D9 <> \"\",VLOOKUP($D9,'Technische Daten'!$A:$L,2,0),0)","v":0},{"$f":"IF(OR(L10 < 0,M10 < 0,D9 <> \"\",P10 <> 0),1,0)","v":0}]
["3200 C",{"$f":"Texte!$B$98","v":"Modulposition"},{"$f":"(ROW() - 4)/ 2","v":3},null,{"$f":"IF(D10<>\"\",VLOOKUP(D10,Texte!A$45:B$107,2,0),\"\")","v":""},{"$f":"IF(VLOOKUP($D10,'Technische Daten'!$A:$L,10,0) <> \"\",1,0)","v":{"$error":"#N/A"}},{"$f":"IF(F10 = 1,VLOOKUP($D10,'Technische Daten'!$A:$L,3,0) / VLOOKUP($D10,'Technische Daten'!$A:$L,10,0) * (-1),0)","v":{"$error":"#N/A"}},null,null,{"$f":"VLOOKUP($D10,'Technische Daten'!$A:$L,5,0)","v":{"$error":"#N/A"}},{"$f":"IF($D10 <> \"\",VLOOKUP($D10,'Technische Daten'!$A:$L,4,0) - VLOOKUP($D10,'Technische Daten'!$A:$L,10,0) * H10 - I10,0)","v":0},"",{"$f":"IF(D10 <> \"\",IF(N9 <> 0,N9+N10,M8+N9+N10),\"\")","v":""},{"$f":"IF($D10 <> \"\",VLOOKUP($D10,'Technische Daten'!$A:$L,2,0),0)","v":0},{"$f":"IF(D8 <> \"\",1,0)","v":0}]
{"$rows_left_out":122}